program: Gaussian 09
title: 000025801
version: EM64L-G09RevD.01
frameworkgroup: C1[X(C7H8ClNO2S)]
method: RPBEPBE
basis: SDD
operation: Freq
keyword: #p
keyword: freq=noraman
keyword: PBEPBE/SDD
title: #p freq=noraman PBEPBE/SDD
converged: NO NO NO NO
title: Mulliken charges:
elementType: Cl S O O N C C C C C C C H H H H H H H H
charge: -0.054457 0.922764 -0.551815 -0.553122 -0.675132 -0.121769 -0.254544 -0.232536 -0.739316 0.605255 -0.283365 -0.359928 0.307475 0.285863 0.264492 0.265787 0.292721 0.236496 0.326155 0.318975
chargesum: 0.00000
title: Mulliken charges with hydrogens summed into heavy atoms:
elementType: Cl S O O N C C C C C C C
charge: -0.054457 0.922764 -0.551815 -0.553122 -0.030002 -0.121769 0.052931 0.053327 0.083684 0.605255 -0.283365 -0.123432
polarizability: 1.80672606e+02 -9.02652644e-01 1.29212788e+02 1.92398593e+00 -1.95088574e-01 7.09393030e+01
1716.lowfreq: -9.7009 -0.0014 0.0024 0.0025 4.5300 7.2564 33.9634 80.5263 107.5197
frequency: 33.8244 80.5228 107.5171 146.6744 152.9328 184.5643 208.8781 229.4559 251.5111 296.4447 298.9184 365.1376 393.4197 397.0107 422.6419 439.7380 466.1149 497.8132 545.0450 582.3243 621.1662 682.7570 724.6419 786.5966 821.1656 825.8748 885.7208 893.0290 954.5705 966.1661 1002.9150 1008.5822 1043.1211 1067.6733 1152.3872 1251.9573 1296.2352 1325.4122 1390.1143 1406.4155 1417.3671 1420.4606 1486.9617 1574.5037 1603.7496 1639.0943 3032.0999 3139.4142 3161.9293 3164.0961 3183.7441 3187.1314 3549.1579 3696.1282
redmass: 6.4609 4.2714 6.2248 4.0376 1.1054 4.8862 9.9287 5.4817 6.1302 6.0468 6.6958 5.5292 8.1718 8.9599 1.3428 2.1655 3.2819 1.1716 4.6269 6.1809 7.4771 7.7841 3.3871 11.7984 1.9500 3.2814 2.6810 1.4661 1.3484 1.3299 2.1092 2.5331 1.8079 2.3982 1.1683 1.3658 1.1396 2.2163 4.3396 1.0534 2.4624 1.4507 3.5506 7.4154 2.9975 1.5299 1.0243 1.0887 1.0935 1.0958 1.1073 1.1079 1.0458 1.1035
irintensity: 4.3977 4.8156 0.6457 0.9165 0.2220 0.4365 2.0442 2.5139 4.4889 12.7527 17.9601 0.4172 34.1037 41.7765 101.7330 1.1811 0.3965 201.8240 17.2612 41.3675 41.9670 23.1247 2.6231 68.8577 46.2298 12.9733 29.8840 13.6219 1.9245 65.0234 50.2152 13.5527 41.4520 98.2198 27.0493 8.8426 3.9892 39.3803 25.8265 8.2531 2.3093 13.1821 110.6825 0.6902 19.4411 337.9061 1.2524 8.9223 1.1054 15.8343 1.0341 1.4046 112.2109 40.6308
temp: 298.150 k
press: 1.00000 atm
elementType: 17 16 8 8 7 6 6 6 6 6 6 6 1 1 1 1 1 1 1 1
symmnumber: 1
zpe: 367629.4 jmol-1
zpe.correction: 0.140023 hartree
zpe.thermalcorrener: 0.152882 hartree
zpe.thermalcorrenthalpy: 0.153827 hartree
zpe.thermalcorrgfe: 0.100319 hartree
zpe.sumelectzpe: -1333.811320 hartree
zpe.sumelectthermal: -1333.798460 hartree
zpe.sumelectthermalent: -1333.797516 hartree
zpe.sumelectthermalfe: -1333.851024 hartree
dipole: -5.2531 3.0907 4.4787
dipole: 7.5636
quadrupole: -81.2922 -82.5984 -88.2001
quadrupole: -9.1612 13.7491 -1.5518
quadrupole: 2.7380 1.4319 -4.1699 -9.1612 13.7491 -1.5518
hfenergy: -1333.9513427 hartree
pointgroup: C01 [X(C7H8Cl1N1O2S1)]
dipole: -2.205309 -1.0055124 -1.7264242 debye
dipolederiv: -0.4693974 0.3022036 0.0064557 0.377642 -0.4987025 -0.0088193 0.0000866 0.0001911 -0.054365 2.0753547 0.0742798 -0.0307042 0.1634233 1.1329032 -0.0034385 -0.1096635 -0.0158945 1.3774612 -0.7210974 -0.0455035 0.019696 -0.1532226 -0.6403668 -0.1428715 0.0294721 -0.0090732 -0.5682554 -0.7831415 0.0479013 -0.0243349 0.1121112 -0.6036536 0.1418303 0.0264137 0.0206062 -0.5691153 -1.6308571 -0.2583921 0.0006995 -0.237519 -0.1640783 0.0004988 -0.0398499 -0.0074463 -0.6871609 -0.5487479 -0.0073725 -0.0195003 -0.0259221 -0.3053922 -0.0050742 0.018195 0.0062228 -0.2811259 0.0682396 0.0326432 0.0118735 -0.1847838 -0.1285371 0.0059147 -0.0142602 0.0259231 -0.0237791 0.0338196 0.107322 0.018401 0.2858105 0.1257103 -0.0033049 -0.004781 -0.0390922 -0.0788057 -0.2664819 -0.0127724 0.0044831 -0.0248961 -0.1105253 0.0014188 0.0178791 0.0058057 -0.2791881 1.5733782 0.4447424 0.0140481 0.3563714 -0.0942091 -0.0018919 0.0304505 0.0042515 0.1613893 0.1413094 -0.5094252 -0.0015653 -0.9690493 0.6340237 0.0126684 -0.0025884 0.0066915 -0.1123192 -0.4127841 -0.1823209 0.0030567 0.2711805 0.1023832 0.0016328 0.0036927 -0.0066413 -0.1975283 0.1725417 -0.043157 -0.0064453 0.0003731 0.0788135 0.00377 -0.0007015 -0.0103269 0.1517674 0.1119198 0.0786849 -0.0054411 0.0423621 0.0785647 -0.00488 -0.0061961 0.0111063 0.1505134 0.108472 -0.0392174 0.00915 -0.0483679 -0.0110517 -0.0411217 -0.0090945 -0.0413449 0.0038798 0.0730798 0.0627821 -0.0029325 0.0752985 0.0231508 0.0407603 -0.0204079 0.0377202 0.0055269 -0.035544 -0.0226037 0.0075544 -0.0244377 0.1177055 0.0013968 0.0681097 0.0066871 0.0658468 -0.0218702 -0.0797023 -0.0006917 -0.0686053 -0.0642776 0.0020801 -0.0011814 0.0013979 0.1741711 0.2830273 0.0090735 -0.0015747 -0.0282297 0.1838521 -0.0006475 0.0078669 -0.001921 0.37628 0.2487795 0.0408342 -0.0022279 0.0804605 0.1436872 0.0000785 0.0065581 0.0051369 0.3848071 unknown
polarizability: 180.2356798|-4.4166781|129.574517|-3.418721|-0.2496063|71.0145004 unknown
InChI: InChI=1S/C7H8ClNO2S/c1-12(10,11)5-2-3-7(9)6(8)4-5/h2-4H,9H2,1H3
charge 0 multiplicity 1
20 atoms
Cl -2.819254 2.160515 0.010759
S  2.4097 0.128943 0.124756
O  2.640064 1.616962 0.766069
O  3.079621 -1.223278 0.758593
N  -3.602662 -0.775711 -0.039231
C  0.549652 -0.158099 0.027846
C  -0.292639 0.967606 0.035403
C  0.066236 -1.477529 0.030558
C  2.992879 0.224845 -1.701802
C  -2.233959 -0.58004 -0.013202
C  -1.672313 0.733442 0.007433
C  -1.324078 -1.682726 0.005801
H  0.121707 1.97881 0.093555
H  0.764363 -2.319157 0.08262
H  2.74426 -0.738927 -2.165657
H  2.464062 1.071819 -2.158889
H  4.076809 0.392603 -1.64128
H  -1.726662 -2.701552 0.009817
H  -4.232332 0.023929 -0.03264
H  -3.993653 -1.712955 -0.036509
