program: Gaussian 09
title: 000277475
version: EM64L-G09RevD.01
frameworkgroup: C1[X(C12H7N3O2)]
method: RPBEPBE
basis: SDD
operation: Freq
keyword: #p
keyword: freq=noraman
keyword: PBEPBE/SDD
title: #p freq=noraman PBEPBE/SDD
converged: NO NO NO NO
title: Mulliken charges:
elementType: O O N N N C C C C C C C C C C C C H H H H H H H
charge: -0.191461 -0.216210 -0.025568 -0.002345 0.025081 0.379182 0.315881 -0.196083 -0.066554 0.268177 -0.549838 -0.288092 -0.301407 -0.176911 -0.168412 -0.366579 -0.358034 0.319482 0.315792 0.304952 0.238403 0.238561 0.250455 0.251528
chargesum: 0.00000
title: Mulliken charges with hydrogens summed into heavy atoms:
elementType: O O N N N C C C C C C C C C C C C
charge: -0.191461 -0.216210 -0.025568 -0.002345 0.025081 0.379182 0.315881 -0.196083 -0.066554 0.268177 -0.230356 0.027700 0.003545 0.061492 0.070149 -0.116124 -0.106506
polarizability: 2.50826089e+02 1.62490893e+01 1.99607191e+02 -2.91609944e-02 -2.63128382e-02 5.81160795e+01
1716.lowfreq: -19.9412 -4.0713 -0.0008 -0.0006 0.0002 5.7852 6.5203 71.5869 101.3429
frequency: -19.1652 71.5670 101.3428 127.5000 205.5624 244.2905 247.3477 276.5651 321.4031 387.4485 407.8769 413.4870 431.8323 471.3576 507.8680 546.5880 593.0997 596.8374 607.4291 623.6786 696.8595 703.6908 718.0332 766.3642 790.7751 799.2257 826.0518 849.3708 886.2080 937.1762 957.3004 960.1516 967.5864 993.7578 1011.0328 1015.9379 1036.3031 1055.7339 1076.8612 1134.4948 1167.5763 1182.5975 1204.8933 1243.5272 1248.2657 1302.1725 1342.4369 1346.5341 1348.9945 1385.6857 1401.0137 1410.1272 1438.1551 1475.7206 1502.1007 1542.0304 1576.2177 1586.3388 1602.3958 3133.5329 3133.7228 3160.8528 3167.9064 3182.0887 3188.8317 3215.5089
redmass: 14.5783 5.8403 5.0182 5.0483 8.4603 4.2193 5.9029 5.7170 10.5823 11.0534 7.7149 4.5164 4.3230 7.1349 3.1670 4.4281 8.7751 3.8256 7.7874 6.4489 7.1648 7.6123 8.0349 4.1105 7.4037 1.5738 1.4993 2.8438 5.3769 6.5374 1.4140 1.4205 1.4682 7.0898 1.3504 1.3621 2.3636 2.3844 2.5714 1.3157 1.3980 5.7068 1.7454 3.1465 2.0066 4.4831 4.3751 3.7647 2.6544 2.9448 2.9942 2.2479 3.3453 4.3737 4.3122 6.9353 6.3931 7.0402 8.2243 1.0900 1.0897 1.0919 1.0951 1.0982 1.0918 1.0945
irintensity: 0.1239 0.6075 3.1915 1.4327 0.0748 5.6737 7.9150 5.0711 1.0014 1.0937 1.6638 0.1302 0.0651 2.0852 4.3590 1.1729 4.9037 3.5164 9.1202 4.7362 3.8671 4.0164 8.9778 10.9533 26.1282 59.7392 31.8837 11.1855 1.2322 16.9629 2.5842 4.5074 16.8908 1.7156 2.6653 1.8326 1.3007 2.3361 11.9441 9.1159 3.1609 339.5960 31.2861 7.9134 17.2862 3.9671 7.3796 67.4198 33.1716 30.2193 15.7758 20.4767 13.1862 28.6613 28.7365 1.2420 6.7449 2.4482 10.4024 14.2661 17.9573 15.2497 18.2961 11.9760 11.1195 11.4953
temp: 298.150 k
press: 1.00000 atm
elementType: 8 8 7 7 7 6 6 6 6 6 6 6 6 6 6 6 6 1 1 1 1 1 1 1
symmnumber: 1
zpe: 441752.3 jmol-1
zpe.correction: 0.168255 hartree
zpe.thermalcorrener: 0.179499 hartree
zpe.thermalcorrenthalpy: 0.180443 hartree
zpe.thermalcorrgfe: 0.130709 hartree
zpe.sumelectzpe: -774.953345 hartree
zpe.sumelectthermal: -774.942101 hartree
zpe.sumelectthermalent: -774.941157 hartree
zpe.sumelectthermalfe: -774.990891 hartree
dipole: -2.8524 4.4826 0.0009
dipole: 5.3132
quadrupole: -89.9974 -100.3268 -98.3363
quadrupole: 10.9094 0.0116 0.0107
quadrupole: 6.2227 -4.1066 -2.1161 10.9094 0.0116 0.0107
hfenergy: -775.1215996 hartree
pointgroup: C01 [X(C12H7N3O2)]
dipole: -0.9679091 1.8527759 0.0003624 debye
dipolederiv: -0.4530408 0.0924905 0.0004569 0.2493976 -1.001436 0.0014026 0.000063 0.0017988 -0.2195547 -0.9234459 -0.0163036 0.0015454 -0.0409865 -0.5063931 0.000803 0.0010573 0.0007142 -0.2301764 -0.3563541 -0.0956523 -0.0000457 -0.0549569 -0.3868653 0.0000123 -0.0000901 0.0000592 -0.226123 -0.3490684 -0.1387717 0.0000141 0.0749203 -0.2676073 -0.0000092 0.0000593 -0.0000539 -0.2380309 1.6201726 -0.3825943 -0.0023476 -0.5539029 1.3987504 -0.0025251 -0.0014949 -0.002698 0.1979286 0.083142 0.0246325 0.0000078 0.0141929 -0.0747402 0.0000165 -0.0000894 0.0000524 0.0728894 -0.2715794 0.0918146 -0.000017 0.0273928 0.0588987 0.0000622 0.0005159 -0.0001932 0.083371 0.1412454 0.1625699 0.0000834 0.040771 0.1709712 -0.0000211 0.0000636 0.0000148 0.0262266 0.1446867 0.3010705 -0.0000134 0.0311595 -0.123804 0.0000062 -0.0000883 -0.0000204 0.0295757 -0.7518544 0.4029887 0.0003907 0.2362335 0.0235977 0.0004035 0.0003359 0.0000967 0.0157154 0.4002224 -0.3822797 -0.000039 -0.02746 -0.0549803 -0.0000611 -0.0005497 0.000255 -0.0582805 0.1475321 0.0184608 0.0000897 -0.0019668 0.0079779 0.0000541 -0.0000763 0.0000751 -0.1098936 -0.09369 0.0067781 -0.0000158 -0.0982241 0.1383227 -0.0000225 0.0000525 -0.0000497 -0.0986118 0.1204608 0.209072 0.0000321 -0.008791 -0.2269325 0.0000204 -0.0001641 0.0001008 -0.1047055 -0.0146031 -0.1194125 0.0000036 -0.2667054 -0.0779659 0.0000018 0.0000063 -0.0000021 -0.0904316 0.050887 -0.1592792 -0.0000254 0.0308763 0.4360265 0.0000242 0.0000012 -0.0001276 -0.0440506 0.2801236 0.1173023 -0.0000191 0.3470347 0.1482444 -0.0000293 -0.0000369 -0.00002 -0.0489493 0.136181 -0.0096045 -0.0000321 0.0131503 0.1062929 -0.0000666 0.0002095 -0.0000683 0.1629156 0.0738779 -0.0062069 -0.0000583 0.077086 0.1847458 -0.0000278 0.0001644 0.0000361 0.1583789 0.1460647 -0.0128058 0.0000158 0.0338856 0.0199029 0.0000054 0.0000108 0.0000105 0.1446604 -0.0437779 -0.1000731 -0.00003 -0.0828975 0.0403327 -0.0000354 -0.0000119 0.000026 0.1583835 -0.0663352 0.0684275 0.0000025 0.0899267 0.0579469 -0.0000002 -0.0000065 0.0000188 0.1556841 0.0799811 -0.0044585 -0.0000085 -0.0411919 -0.1259128 -0.0000203 0.0000574 -0.0000385 0.131057 -0.100828 -0.0681653 0.0000098 -0.0889442 0.0546267 0.0000064 0.0000111 0.0000133 0.1320217 unknown
polarizability: 253.2124788|11.6666094|197.220801|-0.0312962|-0.0237334|58.1160795 unknown
InChI: InChI=1S/C12H7N3O2/c16-15(17)11-7-10-8(3-1-5-13-10)12-9(11)4-2-6-14-12/h1-7H
charge 0 multiplicity 1
24 atoms
O  1.969542 -3.302774 0.002816
O  3.408928 -1.549728 -0.003962
N  -0.031748 2.51681 0.000142
N  -2.610792 -1.642615 0.00006
N  2.209832 -2.034653 -0.000541
C  -1.335137 0.487366 -0.000008
C  1.188666 0.353227 -0.000188
C  -0.030384 1.13713 -0.000014
C  -1.41117 -0.945663 0.000026
C  1.040094 -1.097159 -0.000179
C  -0.201166 -1.715837 -0.000048
C  2.422808 1.081566 0.000045
C  -2.556495 1.222386 -0.000002
C  2.401423 2.481728 0.000304
C  -3.767053 0.519079 0.000055
C  1.153431 3.162065 0.000251
C  -3.745591 -0.9105 0.000081
H  -0.2752 -2.805979 0.000005
H  3.365708 0.536888 -0.000138
H  -2.50691 2.314182 -0.000028
H  3.335506 3.051109 0.000472
H  -4.726764 1.044701 0.000074
H  1.109538 4.257099 0.000342
H  -4.683666 -1.477731 0.000134
