program: Gaussian 09
title: 000275616
version: EM64L-G09RevD.01
frameworkgroup: C1[X(C10H8Br2O2)]
method: RPBEPBE
basis: SDD
operation: Freq
keyword: #p
keyword: freq=noraman
keyword: PBEPBE/SDD
title: #p freq=noraman PBEPBE/SDD
converged: YES YES NO YES
title: Mulliken charges:
elementType: Br Br O O C C C C C C C C C C H H H H H H H H
charge: 0.129954 0.149069 -0.117147 -0.117149 -0.250443 -0.250445 -0.238848 -0.238850 -0.526906 -0.218988 -0.218987 0.228750 0.228753 -0.767337 0.313545 0.313545 0.286860 0.286861 0.238628 0.265482 0.251826 0.251826
chargesum: 0.00000
title: Mulliken charges with hydrogens summed into heavy atoms:
elementType: Br Br O O C C C C C C C C C C
charge: 0.129954 0.149069 -0.117147 -0.117149 0.063103 0.063100 0.048013 0.048011 -0.022796 0.032838 0.032839 0.228750 0.228753 -0.767337
polarizability: 1.70940358e+02 -6.71687672e+00 1.30015874e+02 -2.33034174e-03 3.10930014e-03 1.18661582e+02
1716.lowfreq: -11.4413 -0.0002 0.0004 0.0005 3.2046 13.3555 32.2496 75.5289 108.1547
frequency: 32.1648 75.3400 108.1541 119.2101 141.4914 156.0896 172.6180 212.4949 232.0978 308.4311 414.6067 421.4215 476.6047 508.4210 536.8043 567.9390 588.1542 668.5901 686.5406 732.6608 753.3650 789.2042 795.4528 844.8372 895.5662 897.6087 900.1624 906.3879 925.1770 942.5885 955.3316 997.0380 1002.0316 1022.5048 1087.3925 1090.7627 1096.8904 1111.6826 1127.4049 1138.5668 1205.5503 1211.2934 1233.6418 1257.2232 1262.3809 1265.5588 1274.2718 1316.4717 1479.9918 1571.0756 1641.6894 1674.6601 3002.2949 3053.4685 3064.9487 3098.9624 3107.7631 3113.9683 3164.1642 3195.4549
redmass: 10.5396 3.9741 18.6289 19.2836 14.2489 8.0587 6.5810 7.5541 17.3031 5.1484 4.1217 7.1209 2.2531 4.9784 5.4780 8.1811 4.2226 6.2576 3.6846 2.0169 5.1069 4.9165 4.6542 3.4983 2.7582 2.4671 3.6442 4.1150 1.6736 2.2040 3.0946 1.7925 1.7520 1.5950 2.0247 1.2348 1.5966 1.8188 4.4548 1.6649 1.2742 1.2886 1.5716 1.7438 1.3683 1.4230 1.6391 1.7609 1.1042 5.6208 13.0561 12.9621 1.0654 1.0846 1.0864 1.1002 1.0889 1.0937 1.0878 1.1095
irintensity: 1.3994 0.0093 0.8380 0.9676 3.2964 0.0083 2.1280 0.4111 0.6815 4.6499 0.1924 30.5510 3.1857 0.0158 37.4033 31.9228 0.5828 3.0338 48.1043 71.2044 14.1523 23.1850 0.0253 14.1010 7.3923 12.1807 1.0637 58.9383 0.4126 3.6837 0.8796 0.0432 0.1329 14.2377 3.9643 8.9880 1.0798 1.8539 134.3645 0.0657 11.0160 0.0492 1.2199 0.3564 2.4460 0.5139 2.9077 15.8919 12.8209 0.0317 264.2644 19.1567 31.8119 1.6541 4.9489 25.1395 17.9695 6.1985 3.0554 16.1585
temp: 298.150 k
press: 1.00000 atm
elementType: 35 35 8 8 6 6 6 6 6 6 6 6 6 6 1 1 1 1 1 1 1 1
symmnumber: 1
zpe: 404544.9 jmol-1
zpe.correction: 0.154083 hartree
zpe.thermalcorrener: 0.166332 hartree
zpe.thermalcorrenthalpy: 0.167276 hartree
zpe.thermalcorrgfe: 0.113247 hartree
zpe.sumelectzpe: -562.164922 hartree
zpe.sumelectthermal: -562.152674 hartree
zpe.sumelectthermalent: -562.151730 hartree
zpe.sumelectthermalfe: -562.205758 hartree
dipole: -4.2621 1.4675 0.0000
dipole: 4.5077
quadrupole: -90.6878 -94.5230 -110.4670
quadrupole: -1.9051 0.0000 -0.0004
quadrupole: 7.8714 4.0363 -11.9077 -1.9051 0.0000 -0.0004
hfenergy: -562.3190053 hartree
pointgroup: C01 [X(C10H8Br2O2)]
dipole: -1.6663547 -0.0000584 0.6069488 debye
dipolederiv: -0.2480819 0.0000257 -0.263129 -0.0000312 -0.1109267 0.0000794 -0.1723646 0.0000537 -0.6089868 -0.3819042 -0.0000679 0.3440337 -0.0000075 0.0035946 -0.0000297 0.3787592 0.0000401 -0.4630372 -0.4423027 0.089337 0.0231155 0.0795257 -0.8402683 -0.1314456 0.0939029 -0.1907127 -0.2767047 -0.4422902 -0.0893302 0.0231189 -0.0795013 -0.8403095 0.1314307 0.093878 0.1906572 -0.2767021 -0.5492775 0.1692013 0.0948585 0.0145501 -0.058094 -0.0348537 0.0450762 -0.1275754 0.0660166 -0.5492131 -0.1692159 0.0948087 -0.0145065 -0.0581179 0.0347758 0.044989 0.1275581 0.0660688 0.26038 -0.0392173 0.0720615 0.0798975 0.1169107 0.0152345 0.1994756 0.0634032 0.0474999 0.2603627 0.0392127 0.0720455 -0.0799134 0.1169124 -0.0152521 0.199492 -0.0633825 0.0474799 0.1803796 0.0000094 0.0109723 0.0000201 -0.0979932 -0.000027 -0.0919673 -0.0000169 0.026785 -0.11877 -0.0169059 -0.1460963 0.0454246 -0.0208684 -0.0339861 -0.1426553 -0.0877902 -0.1363768 -0.118822 0.016957 -0.1459359 -0.0453072 -0.020929 0.0337864 -0.1426059 0.0877771 -0.1365217 0.9168351 0.022895 -0.0602575 0.217746 1.0009045 0.1737979 -0.2663673 0.3529629 0.0406215 0.9167872 -0.022889 -0.0602598 -0.2178643 1.0009503 -0.1736738 -0.2663457 -0.3528608 0.0405933 0.2426657 0.000051 -0.2342711 0.0001008 -0.3383715 -0.0001152 -0.2077332 -0.0001235 1.2633354 0.0523777 -0.0095316 -0.0099634 0.0473545 0.035875 0.0385629 0.0157569 0.0417503 -0.0214183 0.0523575 0.0095316 -0.0099518 -0.0473467 0.0358827 -0.0385414 0.015782 -0.0417538 -0.0214141 0.0498391 0.0209613 0.004842 -0.0133368 -0.0780498 -0.0389443 -0.0279478 -0.0477455 0.0624111 0.0498378 -0.0209646 0.0048324 0.0133203 -0.0780545 0.0389554 -0.0279467 0.047729 0.0624206 -0.1487215 -0.0000159 0.1239423 -0.0000069 0.0730197 0.0000061 0.0817302 0.0000061 0.0283181 -0.0514593 0.0000046 -0.130719 0.0000037 0.0734473 0.00001 -0.0957603 0.0000067 -0.0153768 0.0344586 -0.0410891 0.0960822 -0.062401 0.0422219 0.0535238 0.1364574 0.0614192 0.1024219 0.0345614 0.0410407 0.0958705 0.0622793 0.0422635 -0.0532941 0.1363947 -0.0614024 0.102566 unknown
polarizability: 170.6898217|0.003433|118.6615829|-7.4368482|-0.0042246|130.2664096 unknown
InChI: InChI=1S/C10H8Br2O2/c11-10(12)8(13)6-4-1-2-5(3-4)7(6)9(10)14/h1-2,4-7H,3H2
charge 0 multiplicity 1
22 atoms
Br 2.827059 -0.000082 1.732992
Br 3.051761 0.000151 -1.587798
O  1.152454 -2.386574 -0.357469
O  1.152379 2.386659 -0.357194
C  -0.457491 -0.783116 0.639331
C  -0.457513 0.783037 0.639431
C  -1.693757 -1.14384 -0.298625
C  -1.69378 1.14385 -0.298492
C  -1.58397 0.000068 -1.356743
C  -2.933507 -0.683541 0.474391
C  -2.93353 0.683438 0.474454
C  0.876954 -1.236507 0.034739
C  0.876927 1.236543 0.034907
C  1.81106 0.000036 -0.057182
H  -0.577263 -1.237756 1.636551
H  -0.577302 1.237546 1.636708
H  -1.674372 -2.182613 -0.65534
H  -1.67441 2.182665 -0.655085
H  -0.633148 0.000112 -1.923489
H  -2.429607 0.0001 -2.062318
H  -3.624401 -1.349833 0.996852
H  -3.624445 1.349658 0.99698
