program: Gaussian 09
title: 000275607
version: EM64L-G09RevD.01
frameworkgroup: C1[X(C11H10ClNO2)]
method: RPBEPBE
basis: SDD
operation: Freq
keyword: #p
keyword: freq=noraman
keyword: PBEPBE/SDD
title: #p freq=noraman PBEPBE/SDD
converged: YES YES NO NO
title: Mulliken charges:
elementType: Cl O O N C C C C C C C C C C C H H H H H H H H H H
charge: -0.070481 -0.249363 -0.209141 -0.008300 -0.611103 -0.202421 0.610495 -0.325091 -0.386418 0.228980 -0.228617 -0.231264 -0.224492 -0.140702 -0.500904 0.262197 0.259070 0.313404 0.245661 0.256838 0.236221 0.238004 0.246356 0.248257 0.242815
chargesum: 0.00000
title: Mulliken charges with hydrogens summed into heavy atoms:
elementType: Cl O O N C C C C C C C C C C C
charge: -0.070481 -0.249363 -0.209141 -0.008300 -0.089836 0.110984 0.610495 -0.325091 -0.140757 0.228980 0.028221 0.004956 0.013511 -0.140702 0.236524
polarizability: 1.64463710e+02 -1.62377246e+01 1.37862124e+02 -8.66447412e+00 -5.25592418e+00 9.22752036e+01
1716.lowfreq: -8.0593 -0.0006 0.0002 0.0012 5.9860 8.2348 15.8879 28.7282 40.3439
frequency: 15.6202 28.6825 40.3049 64.1489 98.1424 107.5348 136.0864 150.5625 177.9620 220.4725 241.0218 266.3495 285.9171 353.3150 388.8200 421.9416 434.1476 446.8370 508.6805 561.8886 572.9700 630.7180 661.4136 720.2679 733.2127 759.1536 804.4263 823.3363 869.4357 881.9682 940.8052 951.2547 989.5252 1000.9312 1019.0627 1038.9545 1055.5341 1114.5363 1116.6036 1142.2217 1152.6472 1172.6000 1181.7903 1217.8737 1257.9506 1273.2172 1301.4172 1332.2522 1376.2859 1423.6008 1427.6043 1455.5761 1460.3097 1461.8905 1467.8038 1576.0925 1609.0812 1649.7730 2196.4687 3009.8772 3010.9821 3028.7924 3094.2988 3115.2866 3134.4864 3146.2242 3160.0894 3163.4702 3177.4702
redmass: 7.3173 6.8421 6.8913 5.6391 1.9437 1.6883 5.0743 5.2695 6.3637 6.6879 4.8788 4.4217 4.4550 4.6730 6.0828 4.2752 7.0740 3.5284 4.6525 6.0848 3.8574 5.6114 6.5601 4.7834 5.5106 1.2461 5.4914 2.6875 1.6402 3.6726 3.1692 1.4019 1.3418 3.1442 5.9929 2.2543 3.5278 1.3876 1.6593 1.9528 1.4850 1.1720 1.2931 2.2415 1.4606 1.3918 1.3580 1.4721 6.9265 1.1787 2.1538 1.0492 1.2561 1.0677 1.9539 6.0754 7.2745 9.6789 12.5314 1.0522 1.0571 1.0615 1.1028 1.1051 1.0872 1.0900 1.1051 1.0951 1.0998
irintensity: 1.5261 2.8512 2.5635 0.2478 2.1503 1.5427 0.3992 0.8732 0.0901 10.2467 2.1069 1.4874 22.4600 7.0363 0.9158 2.3961 1.3041 8.1410 0.5312 9.1119 13.2953 4.6788 14.2632 2.6628 10.9542 82.5225 9.9122 2.9599 1.3912 3.4146 9.0560 1.1323 0.1481 7.2018 67.4932 1.1332 20.1555 10.2063 18.1361 120.9976 32.8876 31.6287 66.0900 0.4525 107.0516 1.1715 1.2540 5.2553 1.0216 18.7142 19.3904 15.9025 18.9441 14.2003 24.4384 7.9670 1.0998 199.1635 7.4752 28.8224 4.5905 6.5370 3.2713 20.2389 2.3576 9.2957 11.3494 12.1676 10.9463
temp: 298.150 k
press: 1.00000 atm
elementType: 17 8 8 7 6 6 6 6 6 6 6 6 6 6 6 1 1 1 1 1 1 1 1 1 1
symmnumber: 1
zpe: 483351.0 jmol-1
zpe.correction: 0.184099 hartree
zpe.thermalcorrener: 0.199102 hartree
zpe.thermalcorrenthalpy: 0.200046 hartree
zpe.thermalcorrgfe: 0.138817 hartree
zpe.sumelectzpe: -1089.326710 hartree
zpe.sumelectthermal: -1089.311706 hartree
zpe.sumelectthermalent: -1089.310762 hartree
zpe.sumelectthermalfe: -1089.371991 hartree
dipole: 0.2247 1.6477 0.3701
dipole: 1.7036
quadrupole: -68.4110 -101.0457 -101.5870
quadrupole: -8.3121 1.6791 -8.0143
quadrupole: 21.9369 -10.6978 -11.2391 -8.3121 1.6791 -8.0143
hfenergy: -1089.5108086 hartree
pointgroup: C01 [X(C11H10Cl1N1O2)]
dipole: -0.1426076 -0.6165656 0.2207874 debye
dipolederiv: -0.2746556 0.2089262 -0.0059374 0.2033131 -0.6775541 -0.0134971 -0.0003075 -0.0186267 -0.0845881 -1.2699545 0.3379013 0.2486483 0.3760204 -0.396687 -0.1461711 0.4442636 -0.1936633 -0.6874301 -0.654378 0.1133807 -0.2245131 0.1332269 -0.3057627 -0.0370335 0.1507941 -0.0756809 -0.9107911 -0.2051652 -0.0212477 0.0049325 0.0049917 -0.2339667 0.053737 -0.0024103 0.0034616 -0.2338983 0.1383993 0.0878743 -0.0420386 0.0398423 0.0431122 0.0485938 -0.0421101 0.0327851 0.1294492 -0.1609752 0.0865441 -0.0651817 0.0815728 0.0791155 0.0865526 -0.2141586 0.0634618 0.0192191 0.1734383 0.0854337 0.0273097 -0.0089109 -0.2507604 -0.0335684 0.0821979 -0.0138429 -0.051329 0.2022786 -0.3528809 0.0392981 -0.3142438 0.9330951 0.0423849 0.0411485 0.0515259 -0.0455036 -0.0491772 -0.0061829 0.0473396 0.0637202 0.056151 0.0522557 0.0324502 0.0036835 -0.1027941 1.4243061 -0.4762501 0.0556346 -0.5358233 0.3326216 0.1868691 -0.3668114 0.2671514 1.3498101 -0.1255495 0.1231599 0.0194439 0.1355687 -0.1812724 0.0340308 0.0154039 0.0295536 -0.0859649 -0.0730719 -0.0718477 0.0202954 -0.0826138 0.079352 0.0147188 0.0197378 0.0024401 -0.1278038 0.057151 0.002292 0.0918883 -0.0403834 0.0179996 0.0112126 0.0742379 0.0341444 -0.1146802 -0.1348053 0.0195288 -0.0053747 -0.0039573 0.1504174 -0.1491287 0.0164387 -0.0884997 0.0116246 0.6469033 -0.1308491 -0.064267 -0.0860758 0.2970191 0.0090108 0.0195428 -0.0140674 0.2151847 0.040888 -0.0091761 0.0041923 0.0378012 -0.0024232 0.0830901 0.0119718 0.0583367 0.0396606 0.0407407 -0.0163137 -0.0135043 -0.0486208 -0.0150724 -0.0980891 0.0015218 -0.0487726 0.0420578 0.1567021 -0.0033806 -0.0219355 0.0482657 0.0421442 -0.0205607 -0.02311 -0.0075457 0.034916 0.039631 -0.0725995 -0.0614168 -0.0674509 -0.0110206 -0.0398892 -0.0594437 -0.0434887 0.1110885 0.067805 -0.043528 -0.039294 -0.062952 0.0069622 -0.0495781 -0.0480373 -0.0453829 0.1397439 0.054213 0.0708178 -0.0189661 0.0910973 -0.0662204 -0.0144889 -0.0284012 -0.0128095 0.1502204 -0.0792507 0.0310858 -0.0781934 0.0308025 0.0748953 -0.004221 -0.0842925 -0.0039382 0.1317607 -0.0076196 0.000271 0.0366766 0.0325296 -0.0204789 0.0816735 -0.053934 0.1280812 0.0237237 -0.0298591 -0.0008497 -0.0013599 -0.0725038 -0.0532162 -0.0540872 -0.0826071 -0.0496293 0.0848052 0.0220054 0.0378905 0.0463234 0.0447836 0.1015498 -0.0438166 0.0959148 -0.0586775 -0.0384812 unknown
polarizability: 161.5772563|-17.0487751|141.17841|11.0186583|-1.3124174|91.8453712 unknown
InChI: InChI=1S/C11H10ClNO2/c1-15-11(14)9(7-13)6-8-4-2-3-5-10(8)12/h2-5,9H,6H2,1H3
charge 0 multiplicity 1
25 atoms
Cl -1.455533 -2.752519 0.065347
O  3.27511 -1.004595 -0.584662
O  2.809024 -0.517479 1.647228
N  1.115565 1.963814 -1.540342
C  0.016558 -0.158274 1.084733
C  1.042254 -0.274911 -0.088536
C  -1.409076 0.013502 0.594962
C  -2.185193 -1.065134 0.106445
C  -2.02894 1.29123 0.596947
C  2.453549 -0.596311 0.453548
C  -3.506174 -0.918105 -0.353903
C  -3.351508 1.473159 0.1389
C  -4.092834 0.367835 -0.335926
C  1.091302 0.95595 -0.902817
C  4.682302 -1.315758 -0.218526
H  0.115224 -1.0772 1.689052
H  0.310388 0.687987 1.72718
H  0.750321 -1.110345 -0.754148
H  -1.453716 2.1503 0.96069
H  -4.062914 -1.786441 -0.717244
H  -3.799917 2.471757 0.150845
H  -5.120024 0.497613 -0.692209
H  4.708042 -2.128489 0.52603
H  5.169087 -0.418535 0.197909
H  5.152601 -1.622052 -1.1623
