program: Gaussian 09
title: 000025834
version: EM64L-G09RevD.01
frameworkgroup: C1[X(C11H17O3PS)]
method: RPBEPBE
basis: SDD
operation: Freq
keyword: #p
keyword: freq=noraman
keyword: PBEPBE/SDD
title: #p freq=noraman PBEPBE/SDD
converged: NO YES NO NO
title: Mulliken charges:
elementType: S P O O O C C C C C C C C C C C H H H H H H H H H H H H H H H H H
charge: -0.005776 1.071562 -0.505654 -0.475405 -0.621013 -0.902531 0.555268 -0.387331 -0.370543 -0.221157 -0.221983 -0.219465 -0.222894 -0.234835 -0.654273 -0.653415 0.315751 0.286564 0.238754 0.218808 0.227595 0.224627 0.230088 0.292000 0.225968 0.227415 0.210380 0.227477 0.239171 0.208912 0.231659 0.235985 0.228290
chargesum: 0.00000
title: Mulliken charges with hydrogens summed into heavy atoms:
elementType: S P O O O C C C C C C C C C C C
charge: -0.005776 1.071562 -0.505654 -0.475405 -0.621013 -0.300216 0.555268 -0.157243 -0.078543 0.236405 0.230239 0.006504 0.004522 -0.006545 0.022755 0.023140
polarizability: 2.36707186e+02 -7.25632273e+00 1.66176880e+02 8.96614042e+00 1.87556728e+01 1.32399847e+02
1716.lowfreq: -23.1503 -8.8211 -0.0018 -0.0014 0.0015 4.2798 8.1962 15.8411 23.9281
frequency: -20.6982 15.2009 23.3604 33.7949 47.0466 58.9108 72.1880 86.6503 95.0181 121.7937 144.2604 193.3724 201.1040 234.7320 243.0383 269.5846 277.7220 282.0533 291.8405 333.4488 380.0742 403.9041 409.8833 458.7187 485.5784 546.9696 602.3435 616.7426 636.4764 680.2110 706.1893 774.4016 804.7309 805.0272 814.6319 860.0773 865.2457 871.8317 880.0421 937.0407 985.3594 988.5628 1005.2194 1012.5319 1018.0757 1027.2456 1028.2467 1081.6410 1103.3046 1105.4545 1127.7927 1133.3374 1158.6546 1173.5561 1192.9126 1224.3522 1247.8289 1253.8650 1255.2058 1333.7493 1350.6034 1353.0557 1385.2922 1392.9835 1395.3972 1441.6681 1443.3353 1455.9602 1456.8884 1475.7268 1478.4814 1484.9941 1487.5707 1490.5844 1592.8666 1613.1030 2982.3415 2990.1344 2995.7087 2995.9867 3038.9971 3046.4071 3057.4845 3091.7357 3092.0544 3110.7776 3111.1799 3115.0961 3117.3634 3124.5846 3134.9308 3146.5556 3162.8954
redmass: 2.2801 5.1104 2.6587 3.4695 3.5471 4.0055 2.1884 4.6253 5.3980 6.6539 5.5489 3.9613 5.7347 1.3124 1.2752 4.9220 3.4395 4.5819 9.8823 2.2327 4.9237 3.0160 5.3165 4.4548 11.2117 5.9465 4.4206 6.3032 6.3117 6.4005 1.7400 2.0269 1.0967 3.9073 1.0883 1.2968 3.5784 4.0093 1.6621 1.4253 1.4820 4.4204 1.3848 2.5466 3.0003 4.2041 2.6657 1.5716 2.2193 2.2771 1.3971 1.4102 1.0692 1.0508 1.1253 3.0411 1.1593 1.1500 1.1503 1.2604 1.2618 1.2544 8.3760 1.2423 1.2389 1.1741 2.0228 1.0402 1.0398 1.0551 1.0495 2.2859 1.0785 1.0818 6.0592 5.9302 1.0553 1.0527 1.0381 1.0399 1.0586 1.1077 1.1071 1.0981 1.0980 1.1021 1.1021 1.1048 1.0893 1.0875 1.0922 1.0963 1.1016
irintensity: 0.0222 0.5374 1.8641 0.9159 0.3029 1.7386 3.0506 1.7180 0.5591 1.9001 7.0055 0.2562 13.2255 1.4391 0.9520 0.4954 16.7515 14.0062 1.8840 1.8077 16.5768 3.0516 17.6582 7.9387 136.1453 16.6279 74.5535 4.2942 82.4419 116.7978 63.4858 29.3210 4.2945 12.8168 1.9219 10.2929 176.4916 153.2011 3.2777 6.4894 3.1881 0.4334 12.8037 141.0823 151.2394 14.4447 8.9793 9.0067 9.2992 14.1102 4.1313 5.5064 0.7579 0.0632 1.8140 21.3049 0.4761 0.1931 26.0515 1.1875 9.6168 5.4767 0.4801 25.4006 24.0730 12.0922 11.5687 12.2135 11.9714 6.9329 4.9608 11.1345 15.5857 6.9244 1.0420 0.4120 21.9299 26.6308 26.0173 30.0506 11.1931 17.0401 11.6683 21.9318 30.9337 23.8913 41.3430 0.2286 6.0104 2.9961 8.8201 27.0707 35.7434
temp: 298.150 k
press: 1.00000 atm
elementType: 16 15 8 8 8 6 6 6 6 6 6 6 6 6 6 6 1 1 1 1 1 1 1 1 1 1 1 1 1 1 1 1 1
symmnumber: 1
zpe: 685668.8 jmol-1
zpe.correction: 0.261157 hartree
zpe.thermalcorrener: 0.279749 hartree
zpe.thermalcorrenthalpy: 0.280693 hartree
zpe.thermalcorrgfe: 0.210752 hartree
zpe.sumelectzpe: -1393.078346 hartree
zpe.sumelectthermal: -1393.059755 hartree
zpe.sumelectthermalent: -1393.058810 hartree
zpe.sumelectthermalfe: -1393.128751 hartree
dipole: 1.4266 0.1765 -1.8917
dipole: 2.3759
quadrupole: -92.1820 -96.9810 -120.1157
quadrupole: 1.2549 -1.6756 3.6862
quadrupole: 10.9109 6.1119 -17.0228 1.2549 -1.6756 3.6862
hfenergy: -1393.3395031 hartree
pointgroup: C01 [X(C11H17O3P1S1)]
dipole: 0.5472081 0.2774444 0.7052382 debye
polarizability: 228.4067817|20.054027|180.0933648|-17.95486|2.9938063|126.7837663 unknown
InChI: InChI=1S/C7H7S.C4H10O3P/c8-6-7-4-2-1-3-5-7;1-3-6-8(5)7-4-2/h1-5H,6H2;3-4H2,1-2H3
charge 0 multiplicity 1
33 atoms
S  -0.077077 1.729999 0.742742
P  1.464586 0.540462 -0.455698
O  2.260945 -0.275863 0.853118
O  2.657837 1.651314 -1.055997
O  0.910443 -0.358269 -1.646838
C  -1.539467 1.506333 -0.521732
C  -2.470814 0.381844 -0.153844
C  -3.611611 0.624766 0.65454
C  -2.225468 -0.934757 -0.627584
C  3.074934 -1.492928 0.529136
C  3.237444 2.670646 -0.131807
C  -4.492374 -0.427944 0.98818
C  -3.107657 -1.985484 -0.294532
C  -4.242264 -1.736669 0.513887
C  3.614633 -1.997207 1.863153
C  4.221268 3.485717 -0.966181
H  -1.065779 1.353185 -1.504555
H  -2.026859 2.494025 -0.494495
H  2.420521 -2.23567 0.037275
H  3.889061 -1.21237 -0.166882
H  2.417626 3.300316 0.266225
H  3.737582 2.153841 0.709294
H  -3.809219 1.639201 1.023365
H  -1.338485 -1.121843 -1.244852
H  -5.37134 -0.229037 1.611694
H  -2.912416 -2.997419 -0.667135
H  4.221681 -2.907336 1.700896
H  4.249309 -1.23381 2.344273
H  2.785827 -2.245288 2.547098
H  4.687911 4.265845 -0.336334
H  5.017983 2.840748 -1.373501
H  3.70469 3.97649 -1.808028
H  -4.92595 -2.553938 0.770318
