program: Gaussian 09
title: 000275572
version: EM64L-G09RevD.01
frameworkgroup: C1[X(C14H14BrNO)]
method: RPBEPBE
basis: SDD
operation: Freq
keyword: #p
keyword: freq=noraman
keyword: PBEPBE/SDD
title: #p freq=noraman PBEPBE/SDD
converged: YES YES NO NO
title: Mulliken charges:
elementType: Br O N C C C C C C C C C C C C C C H H H H H H H H H H H H H H
charge: 0.004167 -0.251700 -0.452009 -0.258718 -0.200540 -0.295117 -0.520383 -0.496044 -0.226607 -0.221167 0.191940 0.493222 -0.447635 -0.334382 -0.150888 -0.165973 -0.237605 0.256002 0.244151 0.239309 0.259804 0.248016 0.220383 0.273515 0.239167 0.239626 0.307531 0.227661 0.314708 0.249864 0.249703
chargesum: 0.00000
title: Mulliken charges with hydrogens summed into heavy atoms:
elementType: Br O N C C C C C C C C C C C C C C
charge: 0.004167 -0.251700 -0.144477 -0.002716 0.043611 -0.055808 -0.012562 -0.002146 0.012560 0.018459 0.191940 0.493222 -0.219975 -0.019674 0.098976 0.083730 -0.237605
polarizability: 2.92015122e+02 2.14002262e+00 1.49632745e+02 8.83312867e+00 -2.18351128e+00 9.67439638e+01
1716.lowfreq: -13.5873 -0.0007 -0.0005 -0.0003 5.6913 10.7310 18.0206 36.7632 61.0640
frequency: 11.0015 36.6066 61.0608 65.5089 122.2230 131.9129 165.3273 207.2080 238.0662 303.0090 330.1681 340.2761 365.9861 373.0466 410.9982 473.8515 484.0788 513.7562 605.2466 621.2270 640.2222 652.4867 680.6589 706.9908 713.2078 734.1144 772.6812 785.1075 817.1079 818.2294 851.2159 858.8825 874.0012 900.8235 904.9559 916.6002 931.1423 943.0986 950.6687 984.9400 989.1364 989.7510 1000.5756 1019.0811 1035.0003 1062.2181 1090.0554 1108.7976 1116.6098 1135.4002 1148.4689 1162.6011 1178.9641 1186.5243 1226.9588 1249.5298 1261.0726 1264.8217 1270.0869 1283.9091 1293.0607 1325.6617 1334.8465 1362.8060 1396.7485 1457.1385 1470.8899 1473.6674 1495.1690 1578.0047 1588.0978 1602.5724 1616.8753 3006.3431 3023.0400 3025.6163 3078.3630 3088.6348 3092.5417 3103.2675 3119.5772 3152.4262 3165.0882 3172.5345 3185.6727 3196.9841 3524.0218
redmass: 5.2844 4.8852 5.1686 6.2294 6.0389 5.0195 7.7982 5.8143 5.2199 6.4614 4.9515 3.2810 7.0606 2.9659 3.0039 1.8662 2.9976 2.6837 6.1567 6.5284 1.2598 3.3151 3.6124 3.1113 2.6482 2.7847 5.3092 4.3107 1.6016 2.9962 1.4077 2.7351 3.6355 2.8607 2.4784 1.7217 1.6142 1.3627 2.8956 2.0896 3.8319 1.3870 1.9643 1.7545 1.8985 2.4572 1.2499 1.2028 1.3437 1.2402 1.5384 2.1739 1.3176 1.1103 1.3681 1.6073 1.9887 1.3499 1.6937 1.3755 1.3680 1.7175 1.7109 3.6613 4.5120 1.0868 1.1703 2.2106 2.1982 5.6990 6.6289 5.9636 4.3816 1.0841 1.0600 1.0599 1.0888 1.0925 1.1053 1.1077 1.0902 1.0872 1.0912 1.0949 1.1097 1.0952 1.0761
irintensity: 0.5034 0.1286 0.1208 2.1518 4.0609 2.8809 0.8247 0.9688 3.0956 1.0581 5.0534 6.5853 18.3065 2.4209 0.0559 2.8713 3.1824 39.0607 4.1002 0.4643 37.2242 22.5116 11.2815 2.6109 17.7473 48.8100 1.4100 2.7080 23.4323 25.1969 54.9729 8.6405 8.5481 11.9249 13.8786 10.4366 0.4024 1.3592 1.3616 19.0260 34.1033 5.6890 2.3158 6.6111 10.8723 38.9590 6.0113 5.4590 15.6139 19.0734 6.8332 117.1174 4.5483 4.7266 3.7444 5.7298 36.2453 2.8503 6.2939 0.5311 24.5198 15.8029 20.9919 178.1115 21.2824 10.8121 39.1830 110.7857 548.8098 3.5073 47.5449 14.5574 66.6267 25.3459 47.0585 8.8363 55.1469 16.0702 19.0928 20.5981 15.4059 7.1304 3.6995 3.7716 26.1880 10.5546 11.1619
temp: 298.150 k
press: 1.00000 atm
elementType: 35 8 7 6 6 6 6 6 6 6 6 6 6 6 6 6 6 1 1 1 1 1 1 1 1 1 1 1 1 1 1
symmnumber: 1
zpe: 646024.8 jmol-1
zpe.correction: 0.246058 hartree
zpe.thermalcorrener: 0.260569 hartree
zpe.thermalcorrenthalpy: 0.261513 hartree
zpe.thermalcorrgfe: 0.201304 hartree
zpe.sumelectzpe: -684.085525 hartree
zpe.sumelectthermal: -684.071014 hartree
zpe.sumelectthermalent: -684.070070 hartree
zpe.sumelectthermalfe: -684.130278 hartree
dipole: -2.8105 3.3659 -0.7195
dipole: 4.4436
quadrupole: -112.2425 -102.6162 -112.1251
quadrupole: -3.1473 3.0760 -2.4186
quadrupole: -3.2479 6.3784 -3.1305 -3.1473 3.0760 -2.4186
hfenergy: -684.3315825 hartree
pointgroup: C01 [X(C14H14Br1N1O1)]
dipole: -1.0983135 0.95445 0.9690655 debye
polarizability: 289.0101052|-20.0273854|112.4072861|16.004614|21.8883975|136.9744396 unknown
InChI: InChI=1S/C14H14BrNO/c15-11-3-5-12(6-4-11)16-14(17)13-8-9-1-2-10(13)7-9/h1-6,9-10,13,16H,7-8H2
charge 0 multiplicity 1
31 atoms
Br 6.471466 -0.640881 0.261748
O  -0.440341 -0.518301 -1.584353
N  0.398109 0.644717 0.272058
C  -2.789095 -0.346555 0.717819
C  -4.205464 -0.005611 -1.030349
C  -2.01627 0.748628 -0.168313
C  -3.435571 -1.21159 -0.407084
C  -2.987954 0.938227 -1.382679
C  -4.021453 0.380283 1.268417
C  -4.872892 0.581922 0.219631
C  -0.631704 0.237371 -0.58381
C  1.781263 0.316762 0.223466
C  2.624429 0.874716 1.222506
C  2.343317 -0.531802 -0.768465
C  4.005656 0.596402 1.239727
C  3.727014 -0.810187 -0.751336
C  4.546031 -0.247558 0.247506
H  -2.149701 -0.858947 1.45301
H  -4.86614 -0.215962 -1.8844
H  -1.910611 1.680568 0.418331
H  -2.69738 -1.657985 -1.094888
H  -4.108726 -1.985568 -0.002209
H  -3.294351 1.989404 -1.511187
H  -2.497803 0.588942 -2.307754
H  -4.125576 0.744399 2.294321
H  -5.812108 1.142122 0.225274
H  0.11948 1.264561 1.036648
H  2.20462 1.532101 1.994465
H  1.697441 -0.958962 -1.537182
H  4.645308 1.030983 2.012808
H  4.156108 -1.4632 -1.516725
