program: Gaussian 09
title: 000277459
version: EM64L-G09RevD.01
frameworkgroup: C1[X(C14H24O2)]
method: RPBEPBE
basis: SDD
operation: Freq
keyword: #pfreq=noraman
keyword: PBEPBE/SDD
title: #p freq=noraman PBEPBE/SDD
converged: YES YES NO NO
title: Mulliken charges:
elementType: O O C C C C C C C C C C C C C C H H H H H H H H H H H H H H H H H H H H H H H H
charge: -0.193946 -0.211029 0.318337 0.356805 -0.453726 -0.427286 -0.581188 -0.445001 0.121004 -0.476215 -0.780875 -0.751200 -0.749491 -0.526435 0.225146 -0.776355 0.202166 0.195884 0.194261 0.198000 0.233840 0.215932 0.197747 0.211767 0.236663 0.244683 0.249424 0.219415 0.205746 0.205717 0.229272 0.230801 0.216663 0.215516 0.219218 0.242947 0.253297 0.233710 0.241587 0.257198
chargesum: 0.00000
title: Mulliken charges with hydrogens summed into heavy atoms:
elementType: O O C C C C C C C C C C C C C C
charge: -0.193946 -0.211029 0.318337 0.356805 -0.055676 -0.035025 -0.131415 -0.035487 0.121004 0.005131 -0.106290 -0.085410 -0.098094 -0.030192 0.225146 -0.043860
polarizability: 1.80476673e+02 6.13326995e+00 1.41449525e+02 3.04484891e+00 1.53077566e+00 1.34925881e+02
1716.lowfreq: -12.0998 -7.5547 0.0006 0.0007 0.0009 7.5431 22.6194 28.9788 54.7316
frequency: 22.2689 28.8742 54.6560 72.6290 89.8795 122.7847 128.8830 134.9192 177.9791 183.4422 190.4345 223.3172 237.1181 246.8135 253.5050 260.2988 296.4999 332.4437 350.1175 382.5247 383.9764 399.2240 412.0303 423.6513 470.2859 493.4274 501.3614 551.3582 595.7167 621.6858 713.7211 738.4420 757.5118 810.6724 831.1702 834.4254 860.7495 891.0770 908.7752 915.5137 932.1944 935.3446 952.4913 962.9555 980.2945 991.4257 1012.0766 1016.9896 1059.0497 1062.5165 1084.8538 1101.7205 1129.9268 1143.9770 1160.3050 1172.2502 1180.8342 1197.9543 1205.6533 1228.9680 1264.3883 1265.9640 1285.2458 1303.0756 1304.0957 1313.1329 1329.0757 1337.8645 1350.7009 1352.0764 1368.7460 1377.1764 1384.5975 1399.0734 1432.0050 1443.0035 1445.8432 1448.9071 1456.4974 1460.0722 1462.5185 1464.7027 1467.3524 1469.1141 1476.0184 1478.8767 1481.0439 1485.9387 1602.0170 1636.2413 2951.4456 2961.4683 2963.0038 2966.5816 2972.6333 2979.2832 2979.3841 2987.3153 2987.8964 2990.4002 3009.3344 3021.6535 3024.4202 3026.7322 3052.6649 3057.1712 3062.0053 3064.1210 3068.6296 3073.7169 3074.5178 3082.7587 3098.0635 3120.3694
redmass: 5.4885 3.7401 2.9617 2.9750 2.4455 1.3446 2.0437 2.9210 1.6219 1.2662 1.7424 2.3317 1.2130 2.0332 2.5437 2.4998 3.2351 2.7071 2.4694 2.5911 2.1907 1.9558 2.3053 2.6360 2.2364 2.5468 2.4205 3.9918 3.4633 3.8421 3.1151 1.6037 2.2023 2.6102 2.0866 2.3262 2.4119 1.8952 1.6889 1.8745 1.8468 1.5311 1.8338 1.9400 1.7133 1.7533 1.7765 1.5215 2.7803 1.8230 1.9085 1.8009 1.8858 1.6419 2.0984 2.0342 2.0441 2.0405 1.7552 1.7837 1.4638 1.6590 1.3876 1.5600 1.9371 1.3129 1.3918 1.5166 1.3943 1.4790 1.2430 1.1962 1.2004 1.2062 1.0908 1.0642 1.1033 1.0765 1.0573 1.0682 1.0530 1.0740 1.0600 1.0763 1.0718 1.0616 1.0608 1.0646 9.1994 7.6208 1.0607 1.0617 1.0621 1.0352 1.0629 1.0382 1.0383 1.0373 1.0581 1.0576 1.0992 1.0978 1.0949 1.0999 1.1021 1.1026 1.0995 1.0955 1.0998 1.0989 1.0986 1.0984 1.0991 1.1002
irintensity: 6.3084 1.7785 0.1144 1.1001 1.1244 0.1223 0.7864 2.0185 1.9412 1.2268 0.3971 3.2620 0.2872 0.2365 1.2086 0.7373 1.1208 2.6412 0.1457 2.4475 0.0521 0.3710 1.0537 2.2942 3.3792 0.2773 1.0349 11.7447 2.5078 3.2453 2.8310 1.6599 2.6948 3.8157 8.1554 4.7820 0.5181 3.2308 2.1667 12.1713 5.8848 0.5632 8.7637 0.3019 7.4153 2.7208 9.6360 1.5175 2.5676 35.1724 0.9904 1.3440 2.4922 0.3484 1.3576 34.7091 25.5779 73.7762 21.6418 7.3185 94.0625 22.1425 4.7804 1.7248 20.2446 4.3364 2.3131 8.3589 3.2449 19.0715 63.4691 18.3240 30.8218 19.3547 20.1729 16.9096 5.2572 1.8072 16.9848 0.2884 1.6107 11.6503 9.5307 0.6623 30.7058 6.2480 15.6088 15.3815 110.1792 97.6315 30.1356 10.0636 32.3920 38.7374 13.0490 3.4856 35.9857 31.2217 5.1652 13.5070 44.6160 53.2537 0.8108 53.2036 30.0388 7.2027 33.3452 15.1578 28.2516 68.6288 35.4722 37.7347 16.8964 15.0875
temp: 298.150 k
press: 1.00000 atm
elementType: 8 8 6 6 6 6 6 6 6 6 6 6 6 6 6 6 1 1 1 1 1 1 1 1 1 1 1 1 1 1 1 1 1 1 1 1 1 1 1 1
symmnumber: 1
zpe: 917158.2 jmol-1
zpe.correction: 0.349327 hartree
zpe.thermalcorrener: 0.368037 hartree
zpe.thermalcorrenthalpy: 0.368981 hartree
zpe.thermalcorrgfe: 0.302212 hartree
zpe.sumelectzpe: -697.050907 hartree
zpe.sumelectthermal: -697.032198 hartree
zpe.sumelectthermalent: -697.031254 hartree
zpe.sumelectthermalfe: -697.098022 hartree
dipole: 0.7271 0.9106 3.9789
dipole: 4.1460
quadrupole: -90.3955 -106.5633 -105.0018
quadrupole: 12.4338 2.2372 1.8954
quadrupole: 10.2580 -5.9098 -4.3483 12.4338 2.2372 1.8954
hfenergy: -697.4002343 hartree
pointgroup: C01 [X(C14H24O2)]
dipole: 0.253645 -1.5493497 0.4425747 debye
polarizability: 180.5614791|-3.9712657|134.9538222|5.3684174|-1.2258578|141.3367781 unknown
InChI: InChI=1S/C14H24O2/c1-11(15)6-9-14(4)8-5-7-13(2,3)10-12(14)16/h5-10H2,1-4H3
charge 0 multiplicity 1
40 atoms
O  -1.020087 2.069765 1.05897
O  3.665296 0.340148 -1.925166
C  0.263692 -0.005257 0.82048
C  -2.969218 -0.072802 -0.603572
C  -0.162274 -1.469599 0.487932
C  -2.655477 -1.564753 -0.277128
C  -1.647075 0.741775 -0.863308
C  -1.627325 -1.842326 0.84879
C  -0.829015 1.011743 0.395946
C  1.525271 0.407878 -0.023108
C  0.54716 0.149543 2.335356
C  -3.798675 0.576048 0.535229
C  -3.799399 -0.025777 -1.914975
C  2.776746 -0.46194 0.21155
C  3.890985 -0.205986 -0.81284
C  5.291112 -0.658924 -0.413931
H  0.523152 -2.143392 1.038848
H  0.001366 -1.678004 -0.589584
H  -2.294377 -2.060452 -1.203276
H  -3.614108 -2.057925 -0.014856
H  -1.928741 1.724813 -1.284404
H  -1.044923 0.198042 -1.616348
H  -1.668901 -2.925772 1.075124
H  -1.931055 -1.330013 1.784094
H  1.774662 1.46171 0.207115
H  1.28581 0.373362 -1.103243
H  0.793647 1.195739 2.581607
H  -0.338603 -0.126462 2.93581
H  1.382356 -0.502892 2.647728
H  -4.788858 0.087874 0.607084
H  -3.955104 1.653576 0.34659
H  -3.302697 0.490977 1.517541
H  -4.712719 -0.643058 -1.81952
H  -3.217486 -0.410756 -2.773735
H  -4.11231 1.008622 -2.14932
H  3.190375 -0.327004 1.229111
H  2.525077 -1.541137 0.130016
H  5.269195 -1.645872 0.0836
H  5.713956 0.060784 0.314601
H  5.950269 -0.6934 -1.295311
