program: Gaussian 09
title: 000275530
version: EM64L-G09RevD.01
frameworkgroup: C1[X(C20H26O2)]
method: RPBEPBE
basis: SDD
operation: Freq
keyword: #pfreq=noraman
keyword: PBEPBE/SDD
title: #p freq=noraman PBEPBE/SDD
converged: YES YES NO NO
title: Mulliken charges:
elementType: O O C C C C C C C C C C C C C C C C C C C C H H H H H H H H H H H H H H H H H H H H H H H H H H
charge: -0.246138 -0.435135 -0.034195 0.143455 0.602449 -0.442693 -0.445477 -0.465277 0.510439 -0.770140 -0.737850 -0.731537 -0.648472 0.091696 -0.043760 -0.610821 -0.644311 0.435116 0.129607 -0.207088 -0.716119 -0.716314 0.238008 0.197939 0.192441 0.207284 0.207975 0.209702 0.234653 0.226449 0.243384 0.229591 0.227922 0.213003 0.224993 0.225804 0.210360 0.256071 0.229900 0.290430 0.216609 0.219045 0.208891 0.244856 0.245388 0.208695 0.218970 0.354200
chargesum: 0.00000
title: Mulliken charges with hydrogens summed into heavy atoms:
elementType: O O C C C C C C C C C C C C C C C C C C C C
charge: -0.246138 -0.080935 -0.034195 0.143455 0.602449 -0.006746 -0.045751 -0.047599 0.510439 -0.065654 -0.067334 -0.070379 -0.392401 0.091696 -0.043760 -0.380921 -0.353881 0.435116 0.129607 0.009520 -0.043327 -0.043260
polarizability: 3.05343876e+02 -2.45064048e-01 2.26300578e+02 2.02522904e+00 -3.77262000e+00 1.51026000e+02
1716.lowfreq: -7.6095 -0.0008 -0.0007 0.0002 6.8887 9.8266 38.6577 42.3565 66.8437
frequency: 38.5209 42.3432 66.8302 98.6135 114.1719 123.2358 138.9898 160.9614 201.1406 210.1591 210.3730 218.4644 221.3192 239.0961 249.2838 253.3635 260.8834 271.1542 275.0550 300.4962 303.7582 308.8678 327.3911 348.9903 370.6221 373.5760 400.6256 419.4568 426.8938 465.4876 476.0605 478.7743 484.2548 515.7127 527.4796 592.5650 633.1541 649.7190 683.5363 689.5618 694.7100 725.7351 732.0863 760.3193 770.5911 811.3636 838.9809 846.6988 882.8968 888.1206 911.6276 915.9961 923.9970 930.7524 944.8204 953.7137 960.5336 961.6682 986.2186 987.9944 1006.0003 1020.4853 1045.8148 1062.2480 1085.3481 1106.4177 1115.8760 1121.4032 1134.4012 1152.9013 1157.7436 1163.1209 1195.6664 1200.0902 1218.9151 1221.1361 1243.8367 1263.4002 1271.7570 1277.2935 1300.9346 1310.6873 1312.3374 1331.3116 1333.7294 1345.4953 1348.9091 1372.5765 1378.6666 1383.8222 1390.3184 1399.0564 1400.9753 1423.5167 1457.9160 1463.2545 1464.4097 1467.9376 1473.7401 1477.4870 1478.6649 1479.1266 1482.5624 1486.4077 1488.4168 1492.5633 1494.7169 1499.4625 1544.2391 1575.2459 1617.6643 1631.2393 2975.0936 2977.9582 2979.1522 2979.5929 2980.0825 2984.1259 2985.7428 2986.6792 2988.5070 3033.0369 3035.9919 3054.2891 3069.1362 3069.4370 3073.0696 3077.1322 3082.3583 3085.4791 3091.5988 3095.0114 3099.7445 3100.2107 3105.3712 3134.9965 3136.5576 3567.5824
redmass: 3.8384 3.6891 3.2132 2.8133 4.2603 3.4979 3.5558 3.3375 2.0746 1.5825 3.1159 1.0935 2.1421 1.5457 1.6284 2.0446 2.8438 1.7019 1.1651 2.7804 2.5944 3.4716 3.0237 3.1160 3.4305 1.1595 2.3483 3.3266 3.3735 3.6239 2.9110 3.8030 3.5904 3.5009 3.4733 3.9049 4.2668 4.6637 4.1361 3.3286 4.6254 4.5126 5.4706 3.6397 3.0704 2.2292 1.7143 1.6335 2.4769 2.3420 1.9922 1.6408 1.1956 1.5312 2.2202 1.4048 1.5351 1.8779 2.1228 1.6446 1.6767 1.8353 1.8320 1.8939 1.8434 2.1956 2.6071 1.8443 2.6243 1.7681 1.9285 2.4751 1.7854 2.0752 1.7598 1.7151 2.4372 1.9350 1.4873 1.5086 4.6145 1.3118 1.5024 1.6170 1.5397 1.6607 1.4000 1.1924 1.1881 1.2070 1.2216 1.3068 4.3099 4.2009 1.0664 1.0586 1.0428 1.0559 1.0718 1.0819 1.0644 1.0537 1.0593 1.0995 1.1095 1.0785 1.2988 1.7938 9.4732 6.7893 7.4061 7.8075 1.0371 1.0603 1.0546 1.0359 1.0549 1.0421 1.0636 1.0420 1.0572 1.0982 1.0996 1.1031 1.1000 1.0991 1.0992 1.0990 1.1000 1.0994 1.0984 1.1000 1.0926 1.0964 1.0992 1.0903 1.0912 1.0659
irintensity: 1.0869 0.0865 0.1532 0.4116 0.9052 0.3426 0.2769 0.2835 0.8818 1.2352 0.8403 0.1587 0.8735 1.3500 0.4653 0.5479 0.0536 0.2356 0.0059 0.7488 1.3830 0.8194 0.2509 1.5684 7.4296 109.7106 1.8285 5.6412 3.9242 4.9557 6.3932 2.7873 2.0578 0.8716 17.1821 15.3665 2.1335 1.4660 11.4358 1.9463 4.7092 0.0504 4.7717 2.8340 1.4211 4.9312 8.3969 18.0031 2.3673 3.0628 7.1158 17.3321 4.6451 6.3520 3.2615 5.4923 3.4752 2.8773 15.0811 14.9920 7.9847 12.9927 2.3284 44.9869 7.3099 16.1843 1.4060 211.1970 18.2921 3.7576 8.0003 4.8864 0.9165 8.5697 8.5503 14.5458 14.0569 6.4029 5.1486 55.8455 188.1033 2.0699 8.8317 83.5846 15.6459 0.9818 0.5607 19.5398 14.7141 19.2287 16.2374 19.0538 0.8901 18.9285 0.1208 3.6036 2.2297 2.2860 7.9996 24.6072 8.8964 5.9093 17.1515 7.6421 1.5661 21.3924 4.1531 45.3953 172.8040 47.9735 47.7322 144.3748 23.2020 18.5469 30.6171 39.1688 30.8999 44.1592 42.7232 42.9488 26.7418 59.3431 26.0591 45.5156 16.8749 22.6628 77.9133 55.3161 29.0933 15.0854 27.5764 3.0468 0.8748 53.0839 35.7368 22.3965 1.5670 36.0910
temp: 298.150 k
press: 1.00000 atm
elementType: 8 8 6 6 6 6 6 6 6 6 6 6 6 6 6 6 6 6 6 6 6 6 1 1 1 1 1 1 1 1 1 1 1 1 1 1 1 1 1 1 1 1 1 1 1 1 1 1
symmnumber: 1
zpe: 1073761.8 jmol-1
zpe.correction: 0.408974 hartree
zpe.thermalcorrener: 0.430828 hartree
zpe.thermalcorrenthalpy: 0.431772 hartree
zpe.thermalcorrgfe: 0.360621 hartree
zpe.sumelectzpe: -926.527495 hartree
zpe.sumelectthermal: -926.505641 hartree
zpe.sumelectthermalent: -926.504697 hartree
zpe.sumelectthermalfe: -926.575848 hartree
dipole: 2.5179 -5.9512 0.4297
dipole: 6.4762
quadrupole: -123.7845 -138.0764 -134.4238
quadrupole: 0.6257 -0.0981 -0.5919
quadrupole: 8.3104 -5.9815 -2.3289 0.6257 -0.0981 -0.5919
hfenergy: -926.936469 hartree
pointgroup: C01 [X(C20H26O2)]
dipole: -1.0099866 -2.2895241 -0.4796534 debye
polarizability: 305.3691741|-0.3693722|223.8317161|0.3869857|13.9288655|153.4695645 unknown
InChI: InChI=1S/C20H26O2/c1-12(2)13-9-14-15(10-16(13)21)20(5)8-6-7-19(3,4)18(20)11-17(14)22/h9-12,21H,6-8H2,1-5H3
charge 0 multiplicity 1
48 atoms
O  0.079806 3.222085 0.623159
O  3.513043 -2.157408 -0.335509
C  -1.283597 -0.725418 -0.307224
C  -3.752708 0.168045 0.155284
C  -2.218708 0.414476 0.131199
C  -1.645931 -2.083999 0.416888
C  -4.077565 -1.357907 0.114011
C  -3.086038 -2.151729 0.983644
C  0.206431 -0.399446 -0.100172
C  -1.462719 -0.896283 -1.867473
C  -4.423341 0.880056 -1.05969
C  -4.368704 0.762357 1.459887
C  -1.727029 1.662623 0.408088
C  0.66782 0.911756 0.191023
C  -0.298062 2.019263 0.41169
C  1.178564 -1.412165 -0.277856
C  2.060773 1.171196 0.295764
C  3.041413 0.178191 0.123252
C  2.558488 -1.134813 -0.164429
C  4.527218 0.519486 0.24467
C  5.293063 0.284908 -1.085964
C  5.207042 -0.22835 1.423768
H  -0.928682 -2.251694 1.24041
H  -1.4976 -2.908038 -0.308514
H  -4.050623 -1.736967 -0.926114
H  -5.114763 -1.50628 0.47073
H  -3.397515 -3.209925 1.069418
H  -3.099401 -1.738019 2.010572
H  -0.777473 -1.681363 -2.234463
H  -2.49105 -1.191281 -2.131149
H  -1.219132 0.045662 -2.389407
H  -4.263891 1.972221 -1.01508
H  -4.019668 0.51769 -2.021623
H  -5.513509 0.689228 -1.050887
H  -3.949068 0.285653 2.363807
H  -4.189895 1.847772 1.542665
H  -5.462944 0.60153 1.45803
H  -2.396847 2.494221 0.655398
H  0.861373 -2.438813 -0.506802
H  2.357391 2.201733 0.522839
H  4.577906 1.604121 0.467947
H  4.833611 0.853147 -1.915299
H  6.342728 0.617975 -0.982036
H  5.293889 -0.785003 -1.354443
H  5.195765 -1.318054 1.253497
H  6.259253 0.098171 1.522444
H  4.69165 -0.018106 2.378715
H  3.067334 -3.020703 -0.524965
