program: Gaussian 09
title: 000277498
version: EM64L-G09RevD.01
frameworkgroup: C1[X(C21H19N3O3S)]
method: RPBEPBE
basis: SDD
operation: Freq
keyword: #p
keyword: freq=noraman
keyword: PBEPBE/SDD
title: #p freq=noraman PBEPBE/SDD
converged: YES YES NO NO
title: Mulliken charges:
elementType: S O O O N N N C C C C C C C C C C C C C C C C C C C C C H H H H H H H H H H H H H H H H H H H
charge: 0.859260 -0.540870 -0.551409 -0.239309 -0.308332 -0.344061 -0.081040 -0.126347 0.228385 0.351469 -0.059862 -0.174783 -0.250368 0.452740 0.366793 -0.378961 -0.370979 -0.392418 -0.378189 -0.798915 -0.363433 -0.376035 -0.253450 -0.220548 -0.235201 -0.244172 -0.227235 -0.237984 0.283886 0.372508 0.268664 0.293891 0.241671 0.243991 0.321424 0.255474 0.229597 0.229748 0.244042 0.259390 0.252009 0.238056 0.234810 0.233786 0.230128 0.231142 0.231039
chargesum: 0.00000
title: Mulliken charges with hydrogens summed into heavy atoms:
elementType: S O O O N N N C C C C C C C C C C C C C C C C C C C C C
charge: 0.859260 -0.540870 -0.551409 -0.239309 -0.024445 0.028447 -0.081040 -0.126347 0.228385 0.351469 -0.059862 0.093881 0.043523 0.452740 0.366793 -0.137290 -0.126988 -0.070994 -0.122715 -0.095527 -0.104042 -0.124026 -0.015394 0.014262 -0.001415 -0.014045 0.003907 -0.006946
polarizability: 6.27178231e+02 4.57608475e+00 3.11394381e+02 2.84375548e+01 1.57075420e+01 1.92475148e+02
1716.lowfreq: -32.1698 -6.1059 -4.2364 0.0004 0.0008 0.0009 2.6999 5.5654 12.5083
frequency: -32.0955 4.8884 12.3029 19.6409 34.1795 46.6678 53.7876 57.0742 67.0252 86.0092 90.4360 96.2087 118.4140 125.5149 139.9636 173.3633 189.4207 209.9300 228.1879 231.6838 245.9723 265.1626 270.8936 298.2438 314.1431 336.5650 362.1250 367.3454 401.9910 404.5282 405.4636 407.4114 422.8403 439.7161 475.5225 506.0962 527.8451 554.0482 579.3270 587.4427 611.0625 614.9067 621.6065 675.3735 687.7744 696.5429 707.1351 710.8661 717.0596 769.9536 774.4444 775.8210 781.8704 817.5465 835.7223 847.1721 847.9714 866.5350 872.2438 901.8435 923.9874 950.8709 956.9575 974.1187 976.9451 983.5293 987.4764 987.8509 988.8074 992.1425 994.6805 997.9854 1007.3787 1026.3152 1031.8053 1038.5707 1048.0847 1048.7090 1084.2709 1089.3492 1117.8846 1122.2524 1175.0383 1175.9414 1178.4045 1184.4945 1197.2923 1203.9648 1206.7931 1218.6771 1286.7026 1296.4035 1322.7903 1333.4811 1340.1558 1373.6850 1375.1531 1378.7421 1390.9274 1399.0414 1401.7964 1431.3733 1433.9290 1466.9945 1470.4699 1471.4097 1473.4613 1488.3812 1503.4475 1541.2339 1579.3051 1582.4725 1589.9575 1594.3468 1606.7893 1609.0759 2980.4906 3062.9677 3090.2689 3092.2714 3102.1187 3128.2593 3129.6896 3133.8250 3135.5667 3138.8353 3140.6476 3151.2102 3152.6765 3158.4854 3164.2635 3166.9879 3167.7008 3180.3897 3256.5507
redmass: 1.0126 5.9347 5.6491 4.1800 6.6474 6.9539 5.1477 4.2224 4.4347 7.4189 6.1661 5.0939 9.9289 5.7848 7.4234 6.2257 5.4606 6.4148 5.6039 7.4727 8.2797 5.9819 5.0223 4.6253 6.7802 7.8417 8.2864 3.3323 2.8814 3.4784 2.9085 4.8738 8.1045 5.2637 4.4030 3.1122 4.5147 6.2511 5.9032 6.3883 6.4225 6.3629 6.9540 5.9144 4.4080 1.7693 3.3103 1.7791 4.7114 2.3321 5.9592 1.9843 7.5423 1.3528 1.6182 1.2509 1.2495 1.7063 2.3946 3.8994 1.4398 1.4150 1.3213 1.4562 1.3993 1.3975 4.5598 5.8341 1.6275 3.7000 1.3765 1.3297 3.4072 2.3607 1.3346 2.1215 2.4201 1.5973 1.7272 1.6757 1.2893 3.2504 1.1146 1.0797 3.3470 1.1527 1.1656 1.2692 2.2070 2.9979 2.0085 1.2674 1.4118 1.4303 3.5573 6.2044 5.1535 5.6032 3.1408 1.2209 3.0599 2.2518 2.2863 2.0619 1.1037 2.3174 1.0599 2.5037 2.4597 2.6643 5.7237 5.5541 6.7940 6.0049 5.9205 5.5589 1.0389 1.0948 1.0959 1.1000 1.0770 1.0850 1.0861 1.0891 1.0895 1.0887 1.0901 1.0941 1.0955 1.0957 1.0988 1.0958 1.1009 1.0971 1.0760
irintensity: 0.5276 0.4214 0.5632 0.1319 0.1838 1.6901 1.0484 0.4580 4.1071 10.6959 0.5425 0.8046 1.4623 19.7928 9.1603 13.7293 35.7374 15.8494 16.0218 3.6034 4.0858 5.4761 0.6676 2.1966 32.3510 4.1914 46.4686 1.8611 0.7993 1.6911 0.8609 4.1827 94.2869 9.8334 1.7283 69.1154 7.8366 12.7834 29.5872 1.1332 0.9247 0.8930 0.4685 3.8233 7.7933 53.0721 0.6932 66.9751 57.5469 63.1982 26.6524 19.8874 42.2337 29.6745 85.9377 8.6470 6.3768 18.3604 3.3293 44.0977 6.8856 1.4138 0.7066 58.5781 3.7877 0.8023 0.6774 0.0215 3.5105 15.2175 0.7376 0.7382 138.8395 7.4303 7.2476 72.9400 31.5815 22.1130 2.1696 14.3248 11.2733 69.9577 3.1575 3.0325 41.3043 67.7655 35.2258 52.9126 221.6373 4.8019 100.5060 3.6988 4.9133 3.9553 140.4681 1.3640 1.2468 0.6589 11.0229 15.3200 28.0132 11.6516 10.0748 40.6764 15.8368 38.8351 13.3898 1.4179 135.3756 138.2100 2.1679 5.0907 0.6846 10.0484 8.9220 19.7051 31.1569 18.6413 21.2191 14.9211 94.0163 0.6590 0.0960 13.6916 8.9368 6.2638 5.0150 30.6497 20.6279 19.2378 31.2299 11.3486 23.1534 8.5206 7.6044
temp: 298.150 k
press: 1.00000 atm
elementType: 16 8 8 8 7 7 7 6 6 6 6 6 6 6 6 6 6 6 6 6 6 6 6 6 6 6 6 6 1 1 1 1 1 1 1 1 1 1 1 1 1 1 1 1 1 1 1
symmnumber: 1
zpe: 923733.3 jmol-1
zpe.correction: 0.351831 hartree
zpe.thermalcorrener: 0.377923 hartree
zpe.thermalcorrenthalpy: 0.378867 hartree
zpe.thermalcorrgfe: 0.290397 hartree
zpe.sumelectzpe: -1597.384015 hartree
zpe.sumelectthermal: -1597.357923 hartree
zpe.sumelectthermalent: -1597.356979 hartree
zpe.sumelectthermalfe: -1597.445449 hartree
dipole: 3.0852 7.0417 -3.7476
dipole: 8.5526
quadrupole: -135.7813 -175.2514 -174.5127
quadrupole: -6.6131 -8.8456 8.6611
quadrupole: 26.0672 -13.4029 -12.6643 -6.6131 -8.8456 8.6611
hfenergy: -1597.7358461 hartree
pointgroup: C01 [X(C21H19N3O3S1)]
dipole: 1.2839319 -2.9917619 0.8504289 debye
polarizability: 623.4867565|5.8997234|301.0024975|-48.7919823|36.6252411|206.558506 unknown
InChI: InChI=1S/C14H12N3O.C7H7O2S/c15-16-13(11-7-3-1-4-8-11)14(17-18)12-9-5-2-6-10-12;1-6-2-4-7(5-3-6)10(8)9/h1-10,15-16H;2-5H,1H3
charge 0 multiplicity 1
47 atoms
S  2.265073 1.653899 -0.514541
O  2.700113 3.23575 -0.368231
O  1.50414 1.141601 -1.88438
O  -3.692562 2.842001 1.779314
N  1.014071 0.828979 1.270402
N  -0.294887 1.190715 1.219282
N  -2.587256 2.202938 1.562572
C  3.855913 0.655353 -0.301693
C  -1.3302 0.37628 0.769715
C  -1.067075 -1.011206 0.31424
C  -2.635975 0.942767 0.898872
C  3.821315 -0.738117 -0.481582
C  5.024053 1.355685 0.042111
C  6.237636 -0.792752 0.020173
C  -3.877491 0.340161 0.361598
C  5.026226 -1.45513 -0.316331
C  6.217177 0.615823 0.196933
C  -0.167337 -1.296051 -0.746756
C  -1.752034 -2.076956 0.96065
C  7.531426 -1.573386 0.161174
C  -5.082818 0.371172 1.119152
C  -3.904414 -0.223015 -0.946137
C  0.039551 -2.633311 -1.148893
C  -1.522542 -3.410577 0.566597
C  -0.628349 -3.693418 -0.492872
C  -6.272826 -0.170943 0.589151
C  -5.097284 -0.756887 -1.473465
C  -6.286535 -0.736436 -0.706573
H  1.487361 1.515486 1.904582
H  -0.679832 2.105594 1.565305
H  2.889594 -1.250765 -0.738814
H  4.99453 2.443517 0.164791
H  5.024214 -2.543386 -0.447679
H  7.143375 1.141075 0.457258
H  0.337273 -0.476947 -1.275846
H  -2.452401 -1.857585 1.773143
H  7.351306 -2.592319 0.545932
H  8.238841 -1.068824 0.841533
H  8.035273 -1.677484 -0.819339
H  -5.086782 0.813467 2.11834
H  -2.993485 -0.227386 -1.55377
H  0.71419 -2.844157 -1.986358
H  -2.045352 -4.225188 1.078899
H  -0.461816 -4.729305 -0.808921
H  -7.191616 -0.144117 1.185138
H  -5.101172 -1.181763 -2.483126
H  -7.213908 -1.151051 -1.117347
