program: Gaussian 09
title: 000275501
version: EM64L-G09RevD.01
frameworkgroup: C1[X(C4H6N4)]
method: RPBEPBE
basis: SDD
operation: Freq
keyword: #p
keyword: freq=noraman
keyword: PBEPBE/SDD
title: #p freq=noraman PBEPBE/SDD
converged: NO YES NO NO
title: Mulliken charges:
elementType: N N N N C C C C H H H H H H
charge: -0.234950 -0.031801 -0.107541 -0.100997 -0.443181 -0.356027 -0.467975 0.205997 0.248121 0.248186 0.258680 0.258717 0.261377 0.261394
chargesum: 0.00000
title: Mulliken charges with hydrogens summed into heavy atoms:
elementType: N N N N C C C C
charge: -0.234950 -0.031801 -0.107541 -0.100997 0.053126 0.161370 0.054795 0.205997
polarizability: 7.88652402e+01 -5.70186575e-02 6.81858369e+01 -7.04076440e-03 1.32051411e-03 4.11701411e+01
1716.lowfreq: -83.9436 -4.7061 -0.0007 -0.0004 -0.0002 8.8027 17.0457 194.3346 233.3967
frequency: -83.8738 194.3310 233.3941 405.2685 581.6320 649.9765 670.5723 720.3712 764.1584 788.1189 839.3754 899.1381 915.7656 991.2517 1003.9939 1019.9920 1078.4135 1131.7874 1175.3570 1199.2966 1202.6806 1239.5024 1269.5439 1292.4899 1320.0590 1411.1423 1465.1007 1478.8665 1491.7331 1501.6369 3027.7084 3029.7991 3045.8488 3077.4550 3086.5492 3112.2309
redmass: 1.6629 4.1952 3.5779 5.8561 6.3125 6.5774 6.3804 6.7583 1.1388 5.4524 12.1333 3.0301 1.3400 7.8228 9.5850 5.7877 1.6885 5.9907 1.2263 4.7101 1.1231 1.0788 1.3999 1.9483 1.4846 3.3084 1.2271 1.2258 1.6766 1.6296 1.0596 1.0586 1.0622 1.1054 1.1067 1.1060
irintensity: 2.4055 0.0263 0.0391 0.0115 3.4808 0.1583 0.1226 3.8680 10.0226 0.9360 9.6342 5.1519 0.3275 3.4079 8.5577 3.3605 0.0000 4.0564 0.3216 6.1897 0.2178 0.0007 1.1275 6.9027 16.2902 25.6360 9.1370 5.9747 16.6951 5.4105 0.5616 34.1894 35.0007 2.5340 0.4322 32.3805
temp: 298.150 k
press: 1.00000 atm
elementType: 7 7 7 7 6 6 6 6 1 1 1 1 1 1
symmnumber: 1
zpe: 283003.8 jmol-1
zpe.correction: 0.107790 hartree
zpe.thermalcorrener: 0.113172 hartree
zpe.thermalcorrenthalpy: 0.114117 hartree
zpe.thermalcorrgfe: 0.078195 hartree
zpe.sumelectzpe: -374.370480 hartree
zpe.sumelectthermal: -374.365098 hartree
zpe.sumelectthermalent: -374.364154 hartree
zpe.sumelectthermalfe: -374.400075 hartree
dipole: -7.4157 -0.7205 0.0016
dipole: 7.4506
quadrupole: -53.9479 -48.3515 -44.7643
quadrupole: -0.6666 0.0011 0.0005
quadrupole: -4.9266 0.6697 4.2569 -0.6666 0.0011 0.0005
hfenergy: -374.4782706 hartree
pointgroup: C01 [X(C4H6N4)]
dipole: 2.9129532 0.2931477 -0.1458176 debye
dipolederiv: -0.5564717 -0.2045374 0.0252047 -0.0280667 -0.2139265 0.0015177 0.0249713 0.0104394 -0.0565904 0.2817445 0.0086525 -0.0176753 -0.0649517 -0.32608 0.0035362 -0.017497 -0.0000103 -0.0735864 -0.4511427 0.1971202 0.014015 0.0476185 -0.2669788 -0.0021686 0.0143054 -0.009666 -0.1648948 -0.0939844 -0.1134597 -0.0062073 -0.1634048 0.1190893 0.0076165 -0.0061063 0.0051345 -0.2194657 0.083507 -0.0141925 0.0027233 0.0074974 -0.0265583 -0.0001016 0.0023753 0.0009323 0.1350776 0.3379244 0.2006453 -0.001757 0.1319805 0.2343798 -0.0064758 -0.0018212 -0.0097878 0.3036497 -0.0545687 -0.0050509 0.0112965 0.0382115 0.0400329 -0.0016944 0.0110263 0.0004872 0.1689923 0.3547971 -0.0727414 -0.0144899 0.0952999 0.2501708 -0.0048854 -0.0145543 0.0032745 0.0620429 -0.0317143 -0.0031538 -0.087616 -0.0044654 0.0714886 -0.0057001 -0.1338768 -0.0099789 -0.0269578 -0.0086009 -0.0018185 0.0855571 -0.0034072 0.0713311 0.0057308 0.1319904 0.0098444 -0.0499933 0.0225938 -0.0282861 0.0018646 -0.0343546 0.0014057 -0.0728131 -0.035655 -0.1125212 -0.0264998 0.0257648 -0.0166852 -0.0071485 -0.0268917 0.0016447 0.0758618 0.0304387 0.1146339 -0.0293798 0.0419214 0.0320915 -0.0185306 0.0060034 0.0224763 0.0735169 -0.047559 0.1054764 -0.0087108 0.0482298 0.0214162 0.0127632 -0.0010691 0.0215245 -0.0739408 0.0419624 -0.1082583 -0.0136838 unknown
polarizability: 78.7717843|-0.0236443|68.1855073|-1.8772199|-0.0419235|41.2639266 unknown
InChI: InChI=1S/C4H6N4/c1-2-4-5-6-7-8(4)3-1/h1-3H2
charge 0 multiplicity 1
14 atoms
N  -0.073822 0.646283 0.047056
N  -1.377639 1.128598 0.111119
N  -1.342487 -1.172671 0.112914
N  -2.148019 0.004971 0.151493
C  2.215833 0.053438 -0.06816
C  1.244715 1.294687 -0.019704
C  1.333204 -1.257757 -0.020184
C  -0.067619 -0.722976 0.048723
H  2.912195 0.08153 0.785215
H  2.819673 0.078665 -0.989433
H  1.403183 1.928748 0.868401
H  1.312763 1.928091 -0.919749
H  1.566377 -1.880922 0.859772
H  1.477443 -1.885787 -0.915563
