program: Gaussian 09
title: 000270257
version: EM64L-G09RevD.01
frameworkgroup: C1[X(C19H23N5O9S)]
method: RPBEPBE
basis: SDD
operation: Freq
keyword: #p
keyword: freq=noraman
keyword: PBEPBE/SDD
title: #p freq=noraman PBEPBE/SDD
converged: NO YES NO NO
title: Mulliken charges:
elementType: S O O O O O O O O O N N N N N C C C C C C C C C C C C C C C C C C C H H H H H H H H H H H H H H H H H H H H H H H
charge: 0.302243 -0.254127 -0.277080 -0.259034 -0.285263 -0.274785 -0.246267 -0.251817 -0.230129 -0.244188 -0.345473 0.022060 0.025432 -0.060803 -0.623892 -0.100847 -0.152511 -0.072084 0.052510 -0.437729 -0.431515 0.321036 0.316073 -0.300740 0.305276 -0.780838 -0.778583 0.310943 -0.755068 0.157777 -0.110065 -0.743803 0.133582 -0.409562 0.304615 0.309509 0.342710 0.295452 0.329675 0.286813 0.258650 0.339178 0.243321 0.321304 0.239332 0.294244 0.246545 0.240867 0.251366 0.258793 0.253555 0.279449 0.233567 0.251348 0.247547 0.318323 0.333110
chargesum: 0.00000
title: Mulliken charges with hydrogens summed into heavy atoms:
elementType: S O O O O O O O O O N N N N N C C C C C C C C C C C C C C C C C C C
charge: 0.302243 -0.254127 -0.277080 -0.259034 -0.285263 -0.274785 -0.246267 -0.251817 -0.230129 -0.244188 -0.006295 0.022060 0.025432 -0.060803 0.027541 0.203768 0.156998 0.270626 0.347962 -0.108054 0.113948 0.321036 0.316073 -0.300740 0.305276 0.023118 0.003073 0.310943 0.008646 0.157777 -0.110065 0.020561 0.133582 -0.162015
polarizability: 3.62975222e+02 1.39328684e+01 2.58985830e+02 2.28612456e+01 -1.73039650e+01 2.47318608e+02
1716.lowfreq: -12.5403 -7.0593 -0.0007 -0.0007 0.0011 4.2586 14.0704 15.0224 20.6448
frequency: 13.2307 14.3613 20.5176 27.0437 33.2531 38.4146 41.1978 48.7994 55.3054 60.6480 66.6906 70.2277 76.0213 85.5464 95.6815 101.2945 111.1296 116.2496 121.5594 129.9833 147.8889 156.2568 163.3880 174.7443 190.1496 201.9887 205.2304 216.4698 230.6742 238.9856 263.6236 275.2719 283.4939 301.1768 309.9103 317.8680 331.6706 346.6606 359.9193 376.5107 410.7626 419.2295 432.1419 463.7224 489.7443 501.5348 518.1909 523.2061 531.2157 548.9277 561.4653 562.8572 563.9930 566.9640 569.0505 581.0089 585.3569 599.8060 603.9208 616.5275 621.4185 646.2094 650.5575 685.4592 693.3961 738.0435 742.8679 774.8106 793.4547 797.5342 822.7079 847.2296 856.4529 864.4583 885.3561 920.2888 929.9567 932.9278 935.5567 943.5767 965.2578 980.1086 988.6001 992.7747 996.6928 1004.6323 1008.1393 1020.4422 1039.4979 1043.3622 1049.4381 1051.2582 1058.6740 1084.6371 1094.7482 1118.2528 1146.9559 1159.7811 1180.3451 1181.1333 1186.4555 1200.5897 1201.7958 1217.9454 1243.1276 1257.1454 1262.8233 1284.9526 1288.0457 1290.5231 1301.6921 1310.5901 1320.5667 1333.3699 1335.8898 1344.0684 1355.0925 1363.9519 1368.0263 1382.1392 1384.2700 1386.9470 1389.3844 1400.1797 1424.0942 1426.3130 1447.7115 1448.8622 1451.0597 1451.5439 1451.7970 1453.2094 1455.1288 1460.8280 1464.4092 1516.7506 1600.9024 1633.7221 1655.4776 1657.9660 1660.8887 1661.6466 2977.2627 3008.1087 3009.5637 3010.2573 3041.3726 3050.3023 3057.8415 3066.3038 3066.8862 3074.4448 3098.8545 3100.1746 3104.9297 3105.0878 3125.9004 3138.6801 3142.3259 3143.2699 3143.9177 3165.2196 3536.1439 3573.9655 3689.7443
redmass: 4.8153 1.1241 5.7104 6.0869 7.9874 7.9644 5.7015 5.8530 6.7553 3.4113 4.9964 4.2068 3.4737 5.0739 2.7392 3.5204 2.2754 1.4972 2.8854 2.6037 3.5204 2.7697 1.5288 6.7696 6.4855 7.9055 6.5278 6.8620 6.7360 5.7993 7.7389 6.0513 5.0908 4.5724 3.3128 2.7261 4.3317 4.9049 1.5499 5.2066 5.1217 4.9831 3.4660 4.5029 4.3598 4.4325 1.8924 1.9713 6.1691 4.7763 3.2225 3.4342 3.2431 4.0232 3.4224 1.3790 5.3723 5.4101 6.1659 5.0347 4.8278 8.9328 4.6205 9.7058 6.2134 7.5978 3.9837 5.6890 11.6179 4.9965 5.3335 9.4463 5.2395 5.5764 4.5363 5.2449 1.4255 9.1157 6.0768 4.7339 2.1683 3.2018 2.2190 2.1629 2.0730 2.1320 2.9626 3.0944 1.6960 1.6648 1.6519 1.6490 3.1475 3.2506 6.2892 2.1353 2.2703 2.6654 3.1228 2.8215 3.1874 3.2416 1.4020 3.4103 1.1909 1.2942 1.5357 3.3449 3.0123 1.7755 1.2172 1.3181 4.5591 2.2345 1.7214 1.3846 1.3976 4.5090 1.3278 1.3336 1.2401 1.2356 1.3109 1.2363 2.1194 2.4662 1.0942 1.0727 1.0526 1.0558 1.0560 1.0520 1.0506 1.0556 1.0704 7.7630 1.8278 2.5343 9.7445 9.6335 9.0829 9.5700 1.0422 1.0383 1.0368 1.0374 1.0839 1.0643 1.0779 1.0859 1.0938 1.0869 1.0965 1.0945 1.0880 1.0953 1.1072 1.0994 1.1024 1.1010 1.1022 1.0919 1.0453 1.0820 1.1038
irintensity: 14.2210 0.7866 4.5813 1.0603 0.6141 3.6217 0.4859 0.4497 1.2850 1.0332 1.1448 3.4182 0.7797 3.1334 6.7886 4.1244 2.7012 0.6437 2.2652 3.9678 2.4415 0.5288 0.0729 1.6480 5.1560 9.4862 2.5714 2.8256 5.9204 1.7715 7.3758 9.4296 8.4295 15.3853 16.0082 13.6419 2.6491 20.7882 131.2450 9.7268 6.9185 2.9104 11.7471 8.2077 4.8373 18.1213 98.2813 93.9534 9.0755 5.9611 4.5655 0.4230 6.3471 0.3612 5.4726 143.5514 7.3034 25.3502 3.6578 6.8943 13.0639 8.5279 24.0206 6.5625 129.8375 0.8027 12.6968 7.9448 6.8994 21.4735 30.6074 15.0468 51.2722 15.4994 3.2245 176.4640 13.1434 3.3810 39.6263 107.0494 8.4214 17.2608 16.8401 137.5363 96.8018 19.5315 133.4940 68.9865 10.2983 13.8434 9.4650 23.2546 31.3389 49.7160 13.0366 20.3365 25.5428 59.6564 147.7736 343.8634 491.7160 130.5437 14.4970 8.7824 6.8052 10.3351 23.2185 27.8767 11.9937 19.6597 4.2666 10.0077 100.7913 93.7746 37.6400 4.0783 3.1504 65.7354 3.9511 5.2319 72.1003 62.6966 33.1830 42.3299 89.3896 51.2266 67.2646 5.6464 12.4428 15.3453 28.4788 18.0009 10.7882 21.9936 49.2448 88.4103 19.3528 400.5222 167.3125 150.4397 144.6077 221.0920 41.8213 0.5535 5.3979 2.3426 5.1126 4.3212 15.1019 9.4828 11.1243 1.8732 5.0943 4.9713 1.9338 2.4704 0.0238 7.9124 7.7931 6.3897 7.6341 21.2317 79.7950 49.1398 32.3044
temp: 298.150 k
press: 1.00000 atm
elementType: 16 8 8 8 8 8 8 8 8 8 7 7 7 7 7 6 6 6 6 6 6 6 6 6 6 6 6 6 6 6 6 6 6 6 1 1 1 1 1 1 1 1 1 1 1 1 1 1 1 1 1 1 1 1 1 1 1
symmnumber: 1
zpe: 1109405.4 jmol-1
zpe.correction: 0.422550 hartree
zpe.thermalcorrener: 0.457919 hartree
zpe.thermalcorrenthalpy: 0.458863 hartree
zpe.thermalcorrgfe: 0.350122 hartree
zpe.sumelectzpe: -2084.135836 hartree
zpe.sumelectthermal: -2084.100468 hartree
zpe.sumelectthermalent: -2084.099523 hartree
zpe.sumelectthermalfe: -2084.208264 hartree
dipole: -0.1958 5.1445 -5.4982
dipole: 7.5322
quadrupole: -199.8850 -229.0211 -193.4915
quadrupole: 6.7400 -6.8564 8.1574
quadrupole: 7.5808 -21.5552 13.9744 6.7400 -6.8564 8.1574
hfenergy: -2084.5583865 hartree
pointgroup: C01 [X(C19H23N5O9S1)]
dipole: -0.0275336 1.8934058 2.2794566 debye
polarizability: 328.6464969|-39.8846205|272.0832938|48.3948807|0.6989747|268.5498696 unknown
InChI: InChI=1S/C19H23N5O9S/c1-7(25)29-5-11-13(30-8(2)26)14(31-9(3)27)15(32-10(4)28)18(33-11)34-19-23-12-16(20)21-6-22-17(12)24-19/h6,11,13-15,18,23H,5,20H2,1-4H3
charge 0 multiplicity 1
57 atoms
S  -0.004789 -3.169313 0.436549
O  0.4263 -0.61847 1.758703
O  1.623257 -0.943053 -1.378169
O  2.132385 1.738692 -0.658643
O  3.484403 -1.344605 1.814384
O  -1.366984 2.105907 1.07741
O  3.26573 -2.333258 -2.26811
O  3.032029 3.199273 0.931597
O  3.544425 -3.54916 2.573879
O  -0.409905 3.771847 -0.250837
N  -2.139676 -1.347294 0.592613
N  -1.740698 -2.182856 -1.502687
N  -3.663637 -1.085864 -2.627885
N  -5.016357 0.342488 -1.15003
N  -4.567632 0.670226 1.138288
C  2.532611 -0.626035 -0.256578
C  2.032332 0.679026 0.364289
C  2.462969 -1.749202 0.797484
C  0.553287 0.528869 0.787558
C  1.082629 -1.861438 1.475028
C  -0.001469 1.739743 1.553472
C  2.12538 -1.831301 -2.363981
C  2.657438 2.987475 -0.242162
C  -1.331365 -2.153606 -0.219196
C  3.988713 -2.383835 2.630045
C  1.105531 -2.030517 -3.44995
C  2.649629 3.960697 -1.388746
C  -1.429327 3.170086 0.14746
C  5.102083 -1.869102 3.508177
C  -3.123499 -0.800375 -0.235762
C  -2.87657 -1.3527 -1.536753
C  -2.852749 3.452686 -0.264533
C  -4.226597 0.0783 -0.06118
C  -4.698636 -0.250604 -2.349693
H  3.569071 -0.535783 -0.623861
H  2.662623 0.938778 1.234767
H  2.752699 -2.723556 0.37034
H  -0.05221 0.31359 -0.110601
H  1.170889 -2.3822 2.438671
H  0.655657 2.617903 1.459152
H  -0.128406 1.475458 2.614878
H  -1.936304 -1.148133 1.572186
H  0.937492 -1.07823 -3.98481
H  0.132798 -2.326128 -3.012941
H  1.461869 -2.792158 -4.158024
H  1.626964 4.371031 -1.472261
H  2.895655 3.459015 -2.337566
H  3.352995 4.782276 -1.188476
H  5.253764 -2.553941 4.355229
H  6.038035 -1.821743 2.922014
H  4.882528 -0.85089 3.866447
H  -3.256873 2.617201 -0.862526
H  -3.499176 3.559622 0.622233
H  -2.881267 4.372963 -0.865156
H  -5.367595 -0.009145 -3.181125
H  -3.90772 0.735537 1.909026
H  -5.40543 1.250405 1.146763
