program: Gaussian 09
title: 000270248
version: EM64L-G09RevD.01
frameworkgroup: C1[X(C20H13N3O)]
method: RPBEPBE
basis: SDD
operation: Freq
keyword: #p
keyword: freq=noraman
keyword: PBEPBE/SDD
title: #p freq=noraman PBEPBE/SDD
converged: YES YES NO NO
title: Mulliken charges:
elementType: O N N N C C C C C C C C C C C C C C C C C C C C H H H H H H H H H H H H H
charge: -0.257786 -0.469239 -0.397080 -0.053690 0.223137 0.166906 0.211763 0.225233 -0.546735 0.515712 -0.332566 -0.448265 0.001509 -0.386238 -0.364818 0.214047 0.037087 -0.252854 -0.208550 -0.109476 -0.298117 -0.334488 -0.292037 -0.186819 0.312169 0.276686 0.244442 0.253347 0.347809 0.239821 0.238790 0.230314 0.229812 0.250230 0.260697 0.230236 0.229009
chargesum: 0.00000
title: Mulliken charges with hydrogens summed into heavy atoms:
elementType: O N N N C C C C C C C C C C C C C C C C C C C C
charge: -0.257786 -0.157070 -0.049271 -0.053690 0.223137 0.166906 0.211763 0.225233 -0.270049 0.515712 -0.088124 -0.194918 0.001509 -0.146416 -0.126028 0.214047 0.037087 -0.022540 0.021262 -0.109476 -0.047887 -0.073790 -0.061801 0.042189
polarizability: 4.70943774e+02 3.43350609e+00 3.16736684e+02 -1.35723887e+01 -1.45786661e+00 1.10272566e+02
1716.lowfreq: -8.2663 -5.1766 -3.0794 0.0002 0.0004 0.0010 20.7150 38.7390 40.8832
frequency: 20.4863 38.7346 40.8806 103.2832 117.6681 124.0328 137.1740 179.2497 198.0350 236.3559 268.0312 279.2779 293.3769 345.0900 364.8747 409.2380 423.3013 432.2567 447.2033 476.1989 495.1696 500.6409 514.1468 529.2790 540.9543 563.0938 566.8097 612.9653 615.6552 624.6511 653.8279 668.4803 707.3842 721.6290 738.4012 740.8193 753.9110 756.6101 769.6257 775.0449 807.7777 826.4606 842.2573 859.6698 863.4683 865.6891 890.3954 895.7312 900.2609 938.6669 942.3398 953.1811 956.3250 980.7200 986.9803 1004.4045 1007.2786 1019.6930 1081.2775 1108.9430 1118.4486 1140.9430 1148.8450 1168.6568 1175.0983 1206.4404 1226.0603 1230.5332 1248.6306 1259.6946 1285.6684 1293.6042 1305.5672 1345.7350 1349.8436 1388.3746 1401.6230 1426.7664 1441.7213 1449.8069 1466.4585 1489.3846 1493.1393 1510.3098 1519.7864 1584.3254 1591.1523 1599.1967 1622.0635 1626.6383 1641.7066 1656.8063 3129.1602 3131.5867 3137.4236 3138.0752 3141.6396 3151.6073 3159.3268 3163.6562 3169.2066 3172.3443 3174.6489 3201.1122 3606.5973
redmass: 5.6666 6.1087 5.2956 4.8201 5.5997 4.9321 6.9527 5.1506 7.5508 5.6167 6.3533 5.6361 4.5402 6.1048 5.3081 3.7877 3.1691 5.4730 2.9874 8.6726 3.5703 5.3885 1.1519 5.2778 4.3902 5.5874 3.8539 5.8266 5.1335 5.5355 7.1900 8.0188 5.3641 4.9449 3.1648 4.8314 1.5015 1.8047 4.0076 2.6984 1.5395 5.0684 4.7735 1.4448 3.2072 2.0351 1.3796 6.0695 1.5675 1.5430 1.3985 1.3859 2.6319 1.3181 1.3440 2.7969 2.2528 2.0051 3.5975 2.0992 2.6939 1.4444 1.9598 1.1355 1.2961 2.2175 1.6739 1.6826 2.3231 2.9422 1.7078 1.8631 2.4106 2.7641 2.5411 2.6411 3.7234 2.8817 3.1404 2.5518 3.1455 4.5855 4.0629 2.5147 4.5540 6.4398 6.4743 5.6919 6.7433 5.9229 7.7253 9.6885 1.0864 1.0857 1.0883 1.0896 1.0891 1.0952 1.0972 1.0961 1.1001 1.0927 1.0975 1.0736 1.0803
irintensity: 2.3421 0.4487 0.6869 0.5290 5.7258 0.8100 0.0416 2.5960 0.7175 3.1762 1.1780 2.1925 1.5361 2.3159 0.3021 4.0407 11.1518 4.2633 1.4155 33.5177 17.1259 12.3511 92.4325 6.3352 1.8521 4.1550 10.3143 11.2420 11.2897 13.3109 2.9806 7.0896 12.8389 1.5996 18.6607 33.1996 74.5771 72.6876 5.1362 10.4963 44.2094 33.6180 0.8111 1.4498 6.0002 4.6793 58.4486 34.1004 25.6534 6.4598 1.2682 1.3790 22.3700 0.0642 1.7432 1.3850 7.7386 6.0081 58.2243 33.0447 57.4833 65.9529 95.3126 3.9648 14.6616 29.1514 31.1460 28.3061 17.1321 260.1334 77.0716 34.4532 10.3216 25.5012 225.5410 148.2705 130.7364 17.8368 52.7061 64.1101 6.6461 21.4737 81.6793 8.3825 234.1563 50.0209 3.1071 53.6424 97.0242 275.8084 3.8677 354.0559 8.7730 1.2181 3.5083 1.7435 6.8336 23.2897 12.2488 17.1117 28.6503 1.1873 24.3718 55.3719 100.4836
temp: 298.150 k
press: 1.00000 atm
elementType: 8 7 7 7 6 6 6 6 6 6 6 6 6 6 6 6 6 6 6 6 6 6 6 6 1 1 1 1 1 1 1 1 1 1 1 1 1
symmnumber: 1
zpe: 732143.2 jmol-1
zpe.correction: 0.278859 hartree
zpe.thermalcorrener: 0.296368 hartree
zpe.thermalcorrenthalpy: 0.297312 hartree
zpe.thermalcorrgfe: 0.232364 hartree
zpe.sumelectzpe: -1007.812133 hartree
zpe.sumelectthermal: -1007.794624 hartree
zpe.sumelectthermalent: -1007.793679 hartree
zpe.sumelectthermalfe: -1007.858628 hartree
dipole: -10.9918 1.2798 2.5270
dipole: 11.3509
quadrupole: -151.6846 -120.5067 -144.2866
quadrupole: 26.5065 4.2126 -7.9527
quadrupole: -12.8586 18.3193 -5.4606 26.5065 4.2126 -7.9527
hfenergy: -1008.0909915 hartree
pointgroup: C01 [X(C20H13N3O1)]
dipole: 4.3553294 -0.4263929 0.8903461 debye
polarizability: 471.2202736|6.1676699|316.9082479|4.8394639|1.1674568|109.8245023 unknown
InChI: InChI=1S/C20H13N3O/c24-20-19(14-6-2-4-8-17(14)23-20)21-12-9-10-18-15(11-12)13-5-1-3-7-16(13)22-18/h1-11,21-22H
charge 0 multiplicity 1
37 atoms
O  -4.071897 2.589605 -0.699992
N  3.999489 1.514608 0.487152
N  -1.576413 1.727468 -0.033496
N  -4.890618 0.340474 -0.349842
C  1.977731 0.540285 -0.032272
C  3.031268 -0.443748 -0.256793
C  2.621327 1.74654 0.425305
C  4.274684 0.194764 0.078461
C  0.578039 0.509058 -0.18659
C  -0.163235 1.673795 0.124373
C  1.884892 2.916321 0.712844
C  0.488984 2.869501 0.555793
C  -2.535477 0.792643 -0.009306
C  3.037896 -1.785686 -0.703736
C  5.51146 -0.474669 -0.020943
C  -2.724257 -0.579568 0.285837
C  -4.174954 -0.779903 0.062017
C  4.270813 -2.463144 -0.807725
C  5.491473 -1.813361 -0.46912
C  -3.966802 1.354248 -0.40431
C  -1.910027 -1.648389 0.77446
C  -4.731556 -2.067892 0.303799
C  -2.496829 -2.895155 1.016841
C  -3.897864 -3.096058 0.7690
H  4.697913 2.195866 0.776709
H  0.076393 -0.375105 -0.587919
H  2.3733 3.836291 1.048738
H  -0.11406 3.756634 0.779807
H  -2.000861 2.656747 -0.256229
H  2.10405 -2.293367 -0.969372
H  6.455363 0.017349 0.236563
H  4.293443 -3.501654 -1.153799
H  6.435044 -2.362624 -0.558823
H  -0.846108 -1.499599 0.984496
H  -5.800156 -2.226425 0.133299
H  -1.89222 -3.724143 1.397981
H  -4.327827 -4.087307 0.957592
