program: Gaussian 09
title: 000270230
version: EM64L-G09RevD.01
frameworkgroup: C1[X(C19H13Cl2N5)]
method: RPBEPBE
basis: SDD
operation: Freq
keyword: #p
keyword: freq=noraman
keyword: PBEPBE/SDD
title: #p freq=noraman PBEPBE/SDD
converged: YES YES NO NO
title: Mulliken charges:
elementType: Cl Cl N N N N N C C C C C C C C C C C C C C C C C C C H H H H H H H H H H H H H
charge: -0.057023 -0.053279 -0.476943 0.003535 -0.049659 -0.011474 -0.634299 0.386929 -0.072758 -0.192566 0.136114 -0.450314 0.482255 0.326975 0.136259 -0.466680 -0.429646 -0.353378 -0.328736 -0.349193 -0.182080 -0.206500 -0.230276 -0.216497 -0.123736 -0.102805 0.345073 0.237997 0.239282 0.244908 0.249985 0.222955 0.300110 0.256944 0.254526 0.255612 0.257719 0.335236 0.315430
chargesum: 0.00000
title: Mulliken charges with hydrogens summed into heavy atoms:
elementType: Cl Cl N N N N N C C C C C C C C C C C C C C C C C C C
charge: -0.057023 -0.053279 -0.131870 0.003535 -0.049659 -0.011474 0.016367 0.386929 -0.072758 -0.192566 0.136114 -0.212317 0.482255 0.326975 0.136259 -0.227398 -0.184738 -0.103393 -0.105781 -0.049083 0.074864 0.048026 0.025335 0.041223 -0.123736 -0.102805
polarizability: 5.91575653e+02 1.99394301e+01 2.89927030e+02 1.34354584e+00 1.03794775e+01 1.04930220e+02
1716.lowfreq: -2.8159 -0.0019 -0.0009 0.0011 2.6303 8.2218 17.4212 20.5129 26.6457
frequency: 17.2807 20.4165 26.6174 43.5431 56.9354 78.7636 94.9073 114.6073 122.8257 149.9726 192.4701 215.3234 222.8414 231.8119 263.2563 282.9693 300.3390 314.9744 328.1145 357.5375 394.8140 406.1939 406.8661 410.9773 413.3036 443.9271 460.9725 474.5367 498.9128 513.7530 537.6649 559.1896 576.7373 614.9426 620.1324 624.8405 629.6376 658.4904 667.7177 689.6584 695.5758 707.1588 724.8965 742.3819 767.6845 770.3492 799.7646 811.6789 818.2405 825.4054 833.3479 843.9160 852.8135 885.5167 908.3519 940.4967 952.8516 954.7576 986.3817 992.7575 998.5501 1000.9391 1040.8874 1044.3107 1073.8504 1076.2620 1107.8695 1117.9534 1131.0988 1186.2276 1186.6313 1199.3332 1231.4615 1261.3824 1289.3656 1291.3189 1299.2084 1300.2024 1338.7997 1359.4692 1378.2275 1389.5606 1396.4515 1408.2287 1411.5097 1445.3926 1470.0869 1471.3239 1496.6399 1501.3228 1513.8402 1551.7217 1578.8859 1591.0298 1598.8625 1608.3076 1612.9786 1624.4802 3135.8236 3146.6280 3158.5273 3160.3647 3162.7577 3172.2508 3173.1254 3173.6936 3177.2895 3185.3959 3380.9925 3546.5795 3703.0006
redmass: 5.8024 4.9774 7.6640 8.8696 5.4517 7.6989 6.8913 6.2922 8.5609 8.8021 5.9322 7.7786 7.4742 6.1369 9.6753 5.4164 4.8277 5.1714 6.4580 5.3165 1.2053 3.0022 3.9504 9.0238 3.0708 8.0100 5.0597 7.1725 2.8363 4.2264 1.1516 5.4586 7.5459 8.7520 4.6134 7.1061 7.5344 4.2140 7.3576 4.9167 3.7234 4.6204 3.1876 5.8680 1.3200 5.5721 2.6416 1.7046 2.1109 1.4686 1.6799 2.5304 1.3999 1.6609 5.5528 1.3347 1.3729 1.3681 3.6540 4.0535 3.2170 1.3948 3.4740 2.4934 2.5774 2.7195 1.5656 1.3477 2.5763 1.1255 1.1644 4.4806 1.7177 4.5011 1.9390 2.1291 1.4566 1.5548 3.4877 4.8728 3.4673 7.6603 5.8028 3.8152 4.2882 3.5574 2.9737 3.0587 4.0949 3.3860 5.6988 3.0407 7.6285 4.2646 6.0593 5.9248 1.5829 3.5998 1.0900 1.0893 1.0887 1.0891 1.0905 1.0944 1.0960 1.0944 1.0974 1.0947 1.0752 1.0450 1.1046
irintensity: 0.0786 0.0614 0.7305 0.5285 0.2147 0.4440 0.3386 9.5664 1.1405 0.5987 2.4798 2.4302 0.9038 0.3558 1.9184 0.3937 4.1530 0.1050 0.9195 0.4329 139.3803 1.5853 5.3311 19.3614 5.0151 35.4084 9.7577 3.6242 41.5827 43.2874 105.2089 25.9443 8.2619 4.3041 8.4446 0.1752 0.4477 10.4782 2.2011 0.9493 0.4935 6.0207 2.2089 12.2852 37.7469 24.6353 0.5413 6.5276 94.4362 7.9600 35.4045 51.1362 56.4741 5.5404 14.0962 1.1255 2.0380 0.1491 30.9602 18.4661 54.3450 3.4898 9.6754 1.3533 70.5142 57.5137 24.3990 15.4871 7.1042 3.7773 43.4118 9.5417 23.4178 24.4053 38.3891 160.1254 14.9461 26.3397 18.0021 38.7882 102.5103 105.9379 26.2811 3.9923 24.8721 207.1018 431.0614 101.7057 237.8723 6.8352 53.7428 943.4244 4.2609 172.6806 33.9379 117.9225 81.8543 630.0587 8.2319 12.0907 0.4344 9.6099 7.0086 9.8798 7.4807 4.2424 9.2431 2.8481 106.7116 146.1822 34.1182
temp: 298.150 k
press: 1.00000 atm
elementType: 17 17 7 7 7 7 7 6 6 6 6 6 6 6 6 6 6 6 6 6 6 6 6 6 6 6 1 1 1 1 1 1 1 1 1 1 1 1 1
symmnumber: 1
zpe: 739971.1 jmol-1
zpe.correction: 0.281840 hartree
zpe.thermalcorrener: 0.303371 hartree
zpe.thermalcorrenthalpy: 0.304315 hartree
zpe.thermalcorrgfe: 0.228269 hartree
zpe.sumelectzpe: -1923.953573 hartree
zpe.sumelectthermal: -1923.932042 hartree
zpe.sumelectthermalent: -1923.931098 hartree
zpe.sumelectthermalfe: -1924.007144 hartree
dipole: 2.8382 0.6108 -0.3820
dipole: 2.9282
quadrupole: -195.0387 -137.2218 -168.9491
quadrupole: 15.5229 -0.1599 3.0402
quadrupole: -27.9688 29.8481 -1.8793 15.5229 -0.1599 3.0402
hfenergy: -1924.2354132 hartree
pointgroup: C01 [X(C19H13Cl2N5)]
dipole: 1.1194051 0.2434863 -0.1217929 debye
polarizability: 591.7737494|17.3320651|286.7600369|6.8293056|25.3005689|107.8991172 unknown
InChI: InChI=1S/C19H13Cl2N5/c20-12-3-1-11(2-4-12)16-10-23-18-15(9-17(22)26-19(18)25-16)24-14-7-5-13(21)6-8-14/h1-10,24H,22H2
charge 0 multiplicity 1
39 atoms
Cl 8.438659 -1.478679 0.125331
Cl -8.547295 -1.080768 -0.035982
N  2.45545 -0.570392 -0.170375
N  -2.072503 1.093558 0.038178
N  -0.187814 -1.0278 -0.199953
N  -0.32444 2.676839 0.133358
N  1.38647 4.240245 0.188571
C  1.652459 0.552176 -0.051713
C  0.222369 0.274059 -0.067107
C  -0.718497 1.366439 0.036229
C  -2.476627 -0.20131 -0.075847
C  2.039325 1.896458 0.033252
C  3.85739 -0.719695 -0.093052
C  -3.945136 -0.450956 -0.064774
C  1.017062 2.911663 0.116433
C  -1.51552 -1.265856 -0.209144
C  4.438996 -1.850439 -0.734108
C  4.70206 0.163649 0.634459
C  -4.500105 -1.760027 -0.081557
C  -4.831595 0.66142 -0.033446
C  5.825052 -2.089779 -0.665444
C  6.092716 -0.067259 0.698465
C  -5.896789 -1.958207 -0.072733
C  -6.227878 0.480543 -0.024521
C  6.640525 -1.186142 0.044379
C  -6.741714 -0.832008 -0.045871
H  1.888939 -1.418332 -0.331334
H  3.087048 2.200014 -0.007474
H  -1.82049 -2.307667 -0.331536
H  3.80092 -2.540511 -1.298007
H  4.280748 0.998211 1.199367
H  -3.856558 -2.645088 -0.093682
H  -4.393772 1.66365 -0.014252
H  6.262924 -2.959295 -1.163673
H  6.736499 0.609641 1.267563
H  -6.318244 -2.967271 -0.083856
H  -6.903623 1.340173 -0.001776
H  0.642196 4.933477 0.238179
H  2.35869 4.534066 0.179549
