program: Gaussian 09
title: 000270227
version: EM64L-G09RevD.01
frameworkgroup: C1[X(C15H17N3O3S)]
method: RPBEPBE
basis: SDD
operation: Freq
keyword: #p
keyword: freq=noraman
keyword: PBEPBE/SDD
title: #p freq=noraman PBEPBE/SDD
converged: YES YES NO NO
title: Mulliken charges:
elementType: S O O O N N N C C C C C C C C C C C C C C C H H H H H H H H H H H H H H H H H
charge: 0.970214 -0.491094 -0.545990 -0.292030 -0.633641 -0.358954 -0.066559 -0.514186 0.505096 -0.056684 -0.401135 -0.399307 -0.387763 -0.190774 -0.288464 0.280470 0.285240 -0.325082 -0.767853 -0.148666 -0.321439 -0.196499 0.238909 0.210350 0.228279 0.257682 0.239220 0.293043 0.292080 0.293672 0.336781 0.292225 0.231556 0.256219 0.258358 0.208743 0.239997 0.235277 0.232711
chargesum: 0.00000
title: Mulliken charges with hydrogens summed into heavy atoms:
elementType: S O O O N N N C C C C C C C C C C C C C C C
charge: 0.970214 -0.491094 -0.545990 -0.292030 -0.296860 -0.066728 -0.066559 -0.064927 0.505096 -0.056684 0.084826 -0.160087 -0.094721 0.101306 0.005207 0.280470 0.285240 -0.093526 -0.044533 0.091331 -0.086162 0.036212
polarizability: 2.58424302e+02 -3.37308392e+01 1.91058653e+02 9.89902323e+00 2.10853678e+01 2.12816726e+02
1716.lowfreq: -10.3133 -4.5274 -4.0956 -0.0021 -0.0015 -0.0009 7.3396 24.6182 27.7022
frequency: 7.1003 24.4963 27.5804 46.7820 57.9649 62.5038 66.7179 78.8491 90.3465 114.5897 133.4404 156.7416 171.4870 190.0010 216.9168 237.7413 249.5108 275.0906 299.6226 317.4474 355.6220 394.3470 407.0696 408.9169 416.8275 431.3794 456.9501 496.0472 510.9577 513.6383 562.6325 583.5023 591.4479 598.0035 604.6353 620.7335 623.5034 703.2116 706.6666 738.0919 752.9567 774.2473 807.9060 815.0662 843.4732 852.8266 863.9604 866.3689 906.6715 947.8730 948.6884 957.3254 958.5399 968.0553 984.5879 987.7627 988.3676 997.4970 1038.8269 1041.2534 1055.0746 1058.5081 1094.7849 1106.3587 1127.7932 1165.2902 1194.9227 1202.4285 1205.1486 1207.2740 1246.1576 1263.1368 1306.3337 1311.3302 1320.8436 1342.0561 1347.6048 1366.9111 1386.8679 1388.0357 1406.1953 1418.0982 1448.5289 1450.5573 1453.4396 1466.2355 1474.1461 1483.8052 1495.8061 1555.6812 1580.9837 1590.7569 1597.1494 1615.2393 2962.2322 2993.2915 2996.4803 3010.5947 3076.1952 3096.6458 3102.8259 3127.3886 3131.1025 3136.8985 3138.5349 3156.8455 3164.5262 3178.5870 3180.0352 3483.8863 3552.8892
redmass: 5.7806 4.8547 4.1842 4.3816 2.8506 2.6359 3.1909 2.8762 4.7704 6.9835 3.8459 5.2288 4.0466 5.8456 9.0527 7.4873 7.4227 4.4841 4.1366 2.4948 5.3702 7.0459 2.8888 3.6187 3.4882 5.7658 1.5830 2.6003 3.1522 2.8203 1.8247 3.4563 4.6038 4.2976 2.1406 6.3642 6.1856 2.9153 3.1735 1.9131 4.3131 2.1516 2.2778 3.3486 1.5169 5.2466 1.8126 1.3424 2.3283 2.6049 2.5027 1.8784 6.2210 1.8168 1.3294 1.5489 2.4885 1.9572 2.2819 1.6529 2.4284 2.2579 1.6098 3.1353 1.3932 1.0722 1.2419 1.8468 1.5090 1.2684 1.2661 1.9411 1.3112 1.9234 3.9217 1.6819 2.0548 1.3477 5.1561 1.2531 2.2800 2.1911 1.0668 1.1027 2.3223 1.1091 1.8241 1.3658 1.5967 5.7113 5.8323 6.3790 6.2861 5.9981 1.0609 1.0669 1.0364 1.0992 1.0956 1.0996 1.0991 1.0903 1.0888 1.0912 1.0887 1.0953 1.0951 1.1007 1.0947 1.0775 1.0777
irintensity: 0.2201 2.7844 0.6648 7.5810 2.2571 3.1963 8.4029 2.5755 0.2347 6.9354 4.4377 1.5404 2.0147 1.2244 2.9755 8.3275 7.6700 6.4202 16.8709 4.7024 2.6111 21.3428 0.8768 2.9222 29.8435 93.2379 61.8813 8.2190 60.1828 25.4542 128.9980 47.5946 20.4231 13.4784 12.6388 0.4734 7.6271 105.0518 55.5886 56.7631 15.7595 55.0470 106.8162 32.7184 5.6274 30.1067 19.7116 2.2009 17.7396 16.3996 29.8895 7.2655 20.1479 3.6873 0.3397 1.0345 3.4397 1.3196 5.7967 16.2164 22.9577 27.2331 4.6643 6.3343 0.8103 6.5411 11.6603 13.2384 2.6301 1.9273 36.3492 76.9058 7.0494 16.3272 79.6259 1.5286 19.3905 3.6791 2.4529 53.9446 7.2944 85.7490 30.3086 34.0591 134.8343 44.3494 43.8026 46.5545 83.5879 15.6679 137.2179 12.3400 3.5002 141.1464 15.9746 71.9588 10.9863 19.1320 8.2729 16.0967 11.7214 10.9530 17.7820 8.5497 3.0642 19.8175 2.6932 21.3363 6.1246 40.2501 12.5015
temp: 298.150 k
press: 1.00000 atm
elementType: 16 8 8 8 7 7 7 6 6 6 6 6 6 6 6 6 6 6 6 6 6 6 1 1 1 1 1 1 1 1 1 1 1 1 1 1 1 1 1
symmnumber: 1
zpe: 783995.5 jmol-1
zpe.correction: 0.298608 hartree
zpe.thermalcorrener: 0.320604 hartree
zpe.thermalcorrenthalpy: 0.321548 hartree
zpe.thermalcorrgfe: 0.243409 hartree
zpe.sumelectzpe: -1368.014176 hartree
zpe.sumelectthermal: -1367.992180 hartree
zpe.sumelectthermalent: -1367.991235 hartree
zpe.sumelectthermalfe: -1368.069375 hartree
dipole: 1.7649 7.9223 3.1644
dipole: 8.7115
quadrupole: -123.7196 -140.3963 -129.2130
quadrupole: -8.9264 21.6898 -2.8610
quadrupole: 7.3901 -9.2866 1.8966 -8.9264 21.6898 -2.8610
hfenergy: -1368.312784 hartree
pointgroup: C01 [X(C15H17N3O3S1)]
dipole: -1.6650561 2.443147 -1.7336556 debye
polarizability: 229.4995747|49.8239156|213.7123449|7.85007|-15.9316152|219.0877611 unknown
InChI: InChI=1S/C15H17N3O3S/c1-12(19)16-11-9-13-5-7-14(8-6-13)22(20,21)18-15-4-2-3-10-17-15/h2-8,10,16,18H,9,11H2,1H3
charge 0 multiplicity 1
39 atoms
S  2.297126 -1.050048 0.883135
O  3.427324 -1.501686 -0.185199
O  2.260999 -1.689961 2.380713
O  -4.579898 -1.161923 2.043311
N  2.444176 0.766319 1.325175
N  -4.743578 -0.411661 -0.154256
N  2.504017 1.516805 -0.90889
C  -3.297674 -1.838175 -1.661028
C  -1.947368 -1.59369 -0.991587
C  0.586556 -1.221204 0.119712
C  -4.550305 -1.737828 -0.760074
C  -0.843504 -1.220543 -1.80608
C  -1.743429 -1.772639 0.401756
C  0.443197 -1.028997 -1.261937
C  -0.463444 -1.589412 0.97276
C  2.845643 1.734148 0.397527
C  -4.752421 -0.2098 1.21952
C  3.526054 2.91193 0.830306
C  -4.972649 1.228613 1.67503
C  3.829951 3.896282 -0.127827
C  2.832528 2.47545 -1.819241
C  3.482944 3.682854 -1.48495
H  -3.297827 -2.857986 -2.100431
H  -3.404741 -1.145978 -2.520501
H  -5.439254 -2.002478 -1.365985
H  -4.503243 -2.453475 0.078321
H  -0.991364 -1.07694 -2.883323
H  -2.576715 -2.040595 1.060307
H  1.298865 -0.723026 -1.869439
H  -0.285432 -1.742223 2.041807
H  2.78206 0.821447 2.295575
H  -4.864522 0.393036 -0.77124
H  3.800378 3.043559 1.882039
H  -5.82116 1.255841 2.3795
H  -4.079819 1.572078 2.225876
H  -5.171155 1.930386 0.846407
H  4.345562 4.812765 0.178183
H  2.557295 2.255701 -2.857207
H  3.716831 4.41966 -2.258164
