program: Gaussian 09
title: 000277469
version: EM64L-G09RevD.01
frameworkgroup: C1[X(C19H27N3O2)]
method: RPBEPBE
basis: SDD
operation: Freq
keyword: #p
keyword: freq=noraman
keyword: PBEPBE/SDD
title: #p freq=noraman PBEPBE/SDD
converged: YES YES NO NO
title: Mulliken charges:
elementType: O O N N N C C C C C C C C C C C C C C C C C C C H H H H H H H H H H H H H H H H H H H H H H H H H H H
charge: -0.257780 -0.264488 -0.280574 -0.130271 -0.459766 -0.364962 -0.371758 -0.369077 -0.351917 -0.564023 -0.355907 0.202801 0.463672 -0.696096 0.438628 0.497956 0.174436 -0.529079 -0.385268 -0.357805 -0.346951 -0.464052 -0.656363 -0.779232 0.189426 0.187853 0.189830 0.194050 0.201536 0.241711 0.188350 0.186394 0.211026 0.237955 0.194768 0.196427 0.209141 0.215796 0.210163 0.304012 0.276230 0.257407 0.285700 0.309462 0.221881 0.245353 0.274463 0.241149 0.252880 0.241755 0.243158
chargesum: 0.00000
title: Mulliken charges with hydrogens summed into heavy atoms:
elementType: O O N N N C C C C C C C C C C C C C C C C C C C
charge: -0.257780 -0.264488 -0.280574 -0.130271 -0.155754 0.012317 0.012122 0.074169 0.022827 -0.115042 0.035289 0.202801 0.463672 -0.060996 0.438628 0.497956 0.174436 -0.252849 -0.127861 -0.072105 -0.037489 -0.242171 0.104602 -0.041438
polarizability: 3.98544427e+02 -7.30203967e+00 2.24122336e+02 -3.34964641e+00 -1.09927834e+01 1.50854935e+02
1716.lowfreq: -12.9609 -2.5653 -0.0016 -0.0010 0.0015 3.1441 10.2725 16.8197 35.4953
frequency: -5.8929 16.1867 35.4080 39.1321 47.5031 52.7916 61.5818 78.7776 89.9034 100.6785 109.6970 122.8800 134.7726 144.4066 151.5533 153.5217 174.5121 181.5763 200.5902 211.1861 229.2939 248.5317 270.9173 288.6880 310.1416 331.0163 355.5885 373.5346 401.4006 413.3198 416.1501 437.4124 467.1488 521.2420 557.6776 574.3084 595.1970 600.3192 621.2572 631.7362 642.9867 673.9090 693.3357 721.7283 723.1235 728.4654 735.2732 760.8813 799.8592 812.2928 819.4325 831.2013 843.6282 864.7019 888.4212 906.5303 931.2098 940.7285 974.9016 987.0550 989.1600 992.1510 999.1182 1011.4139 1029.8323 1031.7814 1046.7684 1050.9265 1077.4069 1079.2904 1092.2602 1092.7878 1117.8876 1125.2734 1132.8743 1167.6361 1176.2611 1189.2866 1193.3886 1207.6807 1213.0037 1221.0027 1233.4000 1256.8841 1263.1150 1274.2981 1281.6360 1290.1924 1292.6451 1303.0157 1316.5280 1325.0666 1340.1758 1352.8349 1354.5066 1373.1474 1386.2172 1388.1732 1405.8973 1419.0557 1438.4507 1442.7918 1458.9384 1462.9413 1463.3282 1469.8298 1469.8466 1476.6616 1477.1940 1480.0938 1484.8643 1489.2569 1492.6206 1496.4009 1508.1089 1586.8989 1595.4920 1619.1525 1624.8313 1644.1836 2948.5614 2950.5251 2958.2330 2964.6804 2968.0613 2970.9270 2971.7852 2981.2988 2982.6390 2985.9844 2995.0730 3013.7981 3017.9864 3034.2615 3059.1128 3060.2544 3067.5231 3070.2061 3082.7681 3109.5319 3116.9661 3123.2053 3148.1678 3191.3545 3193.5840 3245.1697 3526.8912
redmass: 4.5814 4.6599 1.9225 4.7134 4.6915 2.5926 4.1976 2.9894 2.6145 4.0530 3.5574 2.2649 2.1147 1.8009 1.7916 3.0298 1.4068 3.9429 2.0501 4.4716 1.1045 5.3545 3.8574 2.5562 4.4554 5.2481 4.0212 4.8780 4.6026 3.2698 3.4120 4.9374 3.0309 2.7734 4.0150 4.0939 5.1539 4.0751 5.0166 6.3626 1.1849 4.8313 4.0228 1.0812 3.6504 1.4959 2.2581 1.2493 1.4310 1.9986 1.4528 2.0280 3.5114 1.4327 1.8819 1.2899 6.3685 1.3844 5.1251 1.3609 1.5850 1.1892 4.5623 2.5135 3.1112 2.5383 1.5819 3.1989 2.2613 2.2501 1.6751 1.7477 2.5350 1.3331 1.7211 1.7188 2.2065 1.1861 1.6429 6.4141 2.2490 1.3375 1.4227 1.8730 1.3247 1.2439 1.0569 1.1076 1.1509 1.3754 1.4134 4.5938 1.5231 1.6225 1.6781 4.5016 3.0529 1.2170 1.3719 4.0454 1.1845 1.1020 1.0599 1.0699 1.0730 1.0737 1.0665 1.0431 1.0747 1.1144 1.0837 1.0935 1.7889 1.2413 2.9091 6.4233 6.8010 4.5121 6.5562 10.1657 1.0590 1.0589 1.0593 1.0588 1.0587 1.0368 1.0430 1.0716 1.0394 1.0902 1.0979 1.1006 1.1007 1.1045 1.1028 1.0970 1.1008 1.0993 1.0907 1.0974 1.0907 1.1013 1.0904 1.0943 1.0952 1.0990 1.0763
irintensity: 0.3150 0.9081 1.8294 0.4793 4.3555 5.9637 1.9657 3.1444 1.1102 2.7963 0.6468 0.2829 0.4700 2.1111 1.9589 2.4570 0.0312 1.8665 0.7519 1.0966 0.0002 0.0456 5.6100 7.3909 25.1343 1.6599 1.5168 0.4548 15.5158 0.1802 2.5505 3.2301 3.1794 24.9408 2.0466 3.2669 5.5944 14.4308 22.7247 0.1413 51.9805 7.5316 5.4952 13.8648 0.2458 0.3984 0.3244 4.2131 48.6873 11.1350 25.4131 7.0567 4.2367 55.8071 4.4988 1.8881 8.4346 3.1515 9.5248 3.6418 1.0682 2.0528 0.0967 8.2094 18.2258 30.8150 13.4835 1.6125 5.8512 0.6481 6.0862 28.2879 13.7978 19.3086 65.1336 8.2222 64.6385 2.1566 16.0503 7.8068 7.3189 28.7886 3.2261 68.3895 1.9727 9.6462 1.1600 0.2447 2.6947 41.8495 32.4486 225.0249 16.9579 0.6686 0.9753 15.0621 120.1427 11.9939 34.7598 33.1124 34.4602 10.2713 29.2350 0.1140 0.0994 3.0685 13.5723 12.2354 0.9579 13.1660 5.0578 29.1367 125.1568 11.3069 633.4178 41.6726 22.2926 104.5942 31.0168 341.5597 3.1783 3.0363 23.8051 15.7237 101.2309 38.7183 57.5339 36.2592 28.6622 13.6797 4.6367 6.5586 9.0421 65.0653 63.6846 16.0525 104.6999 55.4051 13.3047 14.3000 23.0667 9.0622 7.0002 3.0494 4.6065 0.8551 11.2942
temp: 298.150 k
press: 1.00000 atm
elementType: 8 8 7 7 7 6 6 6 6 6 6 6 6 6 6 6 6 6 6 6 6 6 6 6 1 1 1 1 1 1 1 1 1 1 1 1 1 1 1 1 1 1 1 1 1 1 1 1 1 1 1
symmnumber: 1
zpe: 1124762.6 jmol-1
zpe.correction: 0.428399 hartree
zpe.thermalcorrener: 0.453330 hartree
zpe.thermalcorrenthalpy: 0.454275 hartree
zpe.thermalcorrgfe: 0.371558 hartree
zpe.sumelectzpe: -1053.112712 hartree
zpe.sumelectthermal: -1053.087781 hartree
zpe.sumelectthermalent: -1053.086837 hartree
zpe.sumelectthermalfe: -1053.169554 hartree
dipole: 0.3668 2.9659 2.7199
dipole: 4.0409
quadrupole: -124.8066 -143.8168 -146.4476
quadrupole: -41.7095 -2.6990 -0.6583
quadrupole: 13.5504 -5.4598 -8.0906 -41.7095 -2.6990 -0.6583
hfenergy: -1053.5411119 hartree
pointgroup: C01 [X(C19H27N3O2)]
dipole: 0.1637741 1.221541 1.0042404 debye
polarizability: 398.3324937|-8.9921461|222.858208|-5.4900455|-14.7507319|152.3309959 unknown
InChI: InChI=1S/C19H27N3O2/c1-4-5-6-7-8-9-18(23)20-16-10-12-17(13-11-16)22-19(24)14-15(2)21(22)3/h10-14,20H,4-9H2,1-3H3
charge 0 multiplicity 1
51 atoms
O  1.928093 0.774112 -1.204486
O  -5.322151 -2.358175 0.075874
N  -4.525897 -0.102151 0.297387
N  -5.090667 1.201332 0.112229
N  1.08043 -1.032656 0.031233
C  6.021703 -0.501467 -0.229495
C  7.123513 0.53971 0.071502
C  4.59841 0.091549 -0.147918
C  8.554211 -0.035923 -0.029091
C  3.498489 -0.954178 -0.445507
C  9.65424 1.008872 0.268142
C  2.110973 -0.312429 -0.576752
C  -3.11676 -0.301024 0.213081
C  11.081339 0.428742 0.163213
C  -6.463477 1.012126 -0.146465
C  -0.315343 -0.747059 0.059548
C  -5.54353 -1.111892 0.056436
C  -6.750537 -0.338501 -0.222035
C  -2.281315 0.594303 -0.502386
C  -2.545078 -1.439059 0.838568
C  -0.889883 0.388222 -0.571543
C  -1.160103 -1.657409 0.750839
C  -4.619548 2.267149 1.025827
C  -7.383509 2.192229 -0.282166
H  6.184494 -0.922671 -1.244053
H  6.117883 -1.350911 0.479404
H  6.966893 0.956798 1.088394
H  7.020819 1.39176 -0.632233
H  4.431577 0.527221 0.857786
H  4.487772 0.920424 -0.871763
H  8.711956 -0.45298 -1.045923
H  8.659728 -0.887568 0.675556
H  3.50476 -1.751044 0.325034
H  3.728023 -1.444402 -1.414086
H  9.496025 1.424373 1.284444
H  9.546492 1.859777 -0.435086
H  11.222832 -0.406307 0.875322
H  11.848139 1.194107 0.383695
H  11.276372 0.037933 -0.853433
H  1.360145 -1.889105 0.515162
H  -7.707471 -0.788036 -0.472878
H  -2.727306 1.439395 -1.037418
H  -3.191018 -2.14727 1.361052
H  -0.24504 1.078085 -1.118348
H  -0.73037 -2.546418 1.230323
H  -5.04377 3.226186 0.689517
H  -3.522391 2.338174 0.982195
H  -4.925447 2.073652 2.073151
H  -8.369604 1.85166 -0.634832
H  -7.535896 2.714909 0.681468
H  -6.9941 2.929128 -1.008189
