program: Gaussian 09
title: 000270226
version: EM64L-G09RevD.01
frameworkgroup: C1[X(C19H30N6O2)]
method: RPBEPBE
basis: SDD
operation: Freq
keyword: #p
keyword: freq=noraman
keyword: PBEPBE/SDD
title: #p freq=noraman PBEPBE/SDD
converged: YES YES NO NO
title: Mulliken charges:
elementType: O O N N N N N N C C C C C C C C C C C C C C C C C C C H H H H H H H H H H H H H H H H H H H H H H H H H H H H H H
charge: -0.338569 -0.198046 -0.128725 -0.391049 0.067717 -0.050513 -0.465779 0.050766 -0.375991 -0.409676 -0.059600 -0.378145 -0.753860 -0.330992 -0.313654 0.379276 -0.683989 -0.701916 -0.074071 -0.518908 -0.167700 0.161474 -0.315082 -0.276258 0.258554 -0.254810 -0.661302 0.206290 0.249471 0.191266 0.211178 0.215480 0.215373 0.194479 0.332200 0.238110 0.232544 0.214422 0.212258 0.192730 0.207533 0.190344 0.219485 0.207692 0.237926 0.218840 0.223388 0.222678 0.296488 0.372012 0.242851 0.241620 0.216670 0.239071 0.254814 0.219479 0.214155
chargesum: 0.00000
title: Mulliken charges with hydrogens summed into heavy atoms:
elementType: O O N N N N N N C C C C C C C C C C C C C C C C C C C
charge: -0.338569 -0.198046 -0.128725 -0.058849 0.067717 -0.050513 -0.093767 0.050766 0.079770 -0.007232 0.155880 0.031706 -0.068785 0.073996 0.084223 0.379276 -0.018886 -0.037009 -0.074071 -0.222420 -0.167700 0.161474 -0.072230 -0.034638 0.258554 0.200931 0.027147
polarizability: 3.60371864e+02 -1.52537840e+01 3.08555394e+02 1.42665695e+00 -1.32622836e+01 1.70570706e+02
1716.lowfreq: -5.9468 0.0002 0.0004 0.0006 0.8359 7.3171 13.4027 19.1771 30.7748
frequency: 11.9763 18.4232 30.7292 35.8731 41.5259 55.8361 62.7089 70.4049 79.1726 84.2000 88.9535 94.1226 110.5783 122.2615 141.9936 181.2716 187.8191 196.2541 210.4117 224.9999 226.9346 236.6739 242.2171 251.5214 259.5096 283.2737 287.2122 304.9952 310.3535 326.5046 331.6722 356.2862 412.6146 418.4181 435.4756 444.4176 463.5603 476.3848 506.0520 508.8292 541.5799 557.9687 568.5137 606.3514 626.7576 647.5618 655.5776 667.9249 692.4985 696.7653 717.1344 723.9451 768.8851 786.8102 801.8935 803.6287 811.7806 815.1206 838.3572 851.7884 854.1381 880.1753 889.4169 897.4423 913.4420 922.0836 940.7488 941.3751 944.2321 986.2027 993.1962 1029.7188 1036.3235 1048.5288 1052.0863 1069.4121 1074.6562 1084.0222 1087.9345 1093.5021 1101.8077 1107.4532 1124.3389 1126.2841 1155.2943 1164.2764 1175.2430 1190.4618 1207.0695 1220.2503 1242.1910 1246.9548 1254.9923 1272.8570 1280.8702 1285.9074 1292.4932 1308.9912 1316.6831 1324.9896 1348.4183 1350.1728 1355.6308 1359.5712 1361.9672 1366.2242 1375.0489 1378.1076 1388.2942 1391.2708 1392.5152 1396.2947 1399.8647 1426.1905 1450.5913 1456.3023 1461.4001 1462.8947 1464.8153 1468.4988 1470.3931 1473.7736 1475.0456 1476.3828 1479.8448 1481.8449 1483.7703 1485.7766 1491.1633 1497.5601 1518.5457 1530.9452 1557.6399 1617.2255 1708.9586 2859.9807 2864.0033 2876.8564 2936.5250 2971.2758 2978.0231 2980.6933 2989.8069 2990.2319 2993.9936 3024.7493 3024.8552 3028.2676 3029.6535 3047.8514 3063.6817 3073.7403 3074.7360 3076.8573 3081.4254 3084.3631 3088.5949 3091.7020 3092.6393 3110.8143 3114.3540 3124.2786 3154.9850 3487.7915 3531.4359
redmass: 3.5021 3.7863 4.3375 4.1951 4.0062 4.1411 4.3064 3.6482 3.7806 5.1687 1.8473 3.0335 2.6923 4.1671 3.7054 4.0193 1.6218 1.4978 1.7530 3.1270 2.1044 1.6539 2.2471 2.0024 2.5201 2.2871 2.7175 1.9114 3.6636 4.1053 2.4917 3.4024 2.6764 2.9983 2.4103 5.6953 2.7152 4.7255 3.4645 4.1022 5.1118 4.6667 6.3240 6.8993 1.3552 1.8354 3.8721 2.8699 2.4177 3.7573 3.7099 5.2351 6.3014 1.2712 1.2066 1.1442 1.6285 5.6596 2.3418 3.8692 1.2396 1.8233 1.9304 2.7098 2.0900 1.6177 1.4869 4.5082 2.4671 1.7651 3.7295 3.2407 2.9898 2.1006 3.4724 1.9981 2.9553 2.2284 2.6321 2.2271 2.2972 1.9544 3.0384 2.2184 1.7243 1.9725 2.5749 2.3160 2.4803 1.4135 4.2793 1.5500 1.4391 1.2210 1.1089 1.1430 1.1850 1.3068 2.0842 1.4162 1.7477 1.2287 1.2644 1.5195 1.5662 1.2881 2.1510 1.6616 1.2363 1.2460 1.2441 1.2357 2.1732 2.5946 2.5929 1.0914 1.0582 1.0848 1.0758 1.8965 1.1059 1.1188 1.1329 1.1896 1.0710 1.0752 1.0523 1.0813 1.0763 1.0786 5.9669 2.3692 3.2553 5.5075 8.6624 1.0723 1.0718 1.0707 1.0829 1.0632 1.0362 1.0370 1.0362 1.0360 1.0668 1.0906 1.0614 1.0870 1.0879 1.0900 1.0988 1.0978 1.0990 1.1007 1.0981 1.0985 1.1026 1.0998 1.0988 1.0948 1.1051 1.0888 1.0970 1.0767 1.0760
irintensity: 0.3725 0.0438 0.5479 1.4500 0.4654 0.8161 1.2609 0.4603 0.5798 0.0361 0.1907 0.0602 0.2916 0.4413 0.5273 7.5654 0.4337 5.1658 0.0376 0.4440 0.3035 0.6139 0.9216 1.9152 0.5996 2.5399 0.6357 2.9776 4.0153 9.5575 2.1642 1.1113 2.0398 6.3682 3.1739 2.4253 2.2076 2.5069 5.3355 2.9942 2.1189 2.1509 10.0569 3.8357 28.5581 69.3579 24.2052 3.6051 11.5241 5.0567 44.9018 32.0200 1.8385 2.6794 2.2319 4.7761 9.7147 2.6452 3.1482 9.4197 26.5387 15.5470 44.5028 24.7988 0.8247 0.6509 0.6977 85.7131 3.8076 10.2014 17.6113 123.4471 87.4164 82.6935 193.9786 14.0761 5.9604 2.1360 10.6092 76.4480 17.2752 19.3936 220.5290 38.4641 12.8350 19.0049 58.0528 25.3536 30.0887 14.0520 11.8244 24.9646 29.8307 3.1581 3.2173 5.1614 7.9312 8.8152 32.5518 12.3621 18.6096 5.5642 4.5393 19.4499 9.2720 3.0886 131.5464 98.5769 38.7273 9.5561 50.3619 10.2909 17.6390 182.8995 39.7073 27.0399 7.5813 11.6948 4.7285 197.2817 38.7526 42.3116 42.1013 56.4693 6.3711 13.1134 14.2505 6.0893 23.6865 31.9686 148.4023 316.4800 431.3593 387.6399 246.2148 23.4876 50.1028 296.9858 19.1852 44.2266 20.7913 26.7462 17.0784 25.0559 23.2066 32.8238 39.8551 7.3061 15.6060 40.8165 31.1910 41.2538 43.1864 36.3928 47.2826 37.4471 8.0838 38.3389 32.1819 16.2240 35.6294 12.6861 48.7271 62.9715 90.5155
temp: 298.150 k
press: 1.00000 atm
elementType: 8 8 7 7 7 7 7 7 6 6 6 6 6 6 6 6 6 6 6 6 6 6 6 6 6 6 6 1 1 1 1 1 1 1 1 1 1 1 1 1 1 1 1 1 1 1 1 1 1 1 1 1 1 1 1 1 1
symmnumber: 1
zpe: 1256691.5 jmol-1
zpe.correction: 0.478649 hartree
zpe.thermalcorrener: 0.507251 hartree
zpe.thermalcorrenthalpy: 0.508195 hartree
zpe.thermalcorrgfe: 0.416618 hartree
zpe.sumelectzpe: -1218.909353 hartree
zpe.sumelectthermal: -1218.880750 hartree
zpe.sumelectthermalent: -1218.879806 hartree
zpe.sumelectthermalfe: -1218.971384 hartree
dipole: -0.0234 8.3229 -0.9609
dipole: 8.3782
quadrupole: -133.4982 -173.1102 -161.6004
quadrupole: -3.1693 0.2645 1.5683
quadrupole: 22.5714 -17.0406 -5.5308 -3.1693 0.2645 1.5683
hfenergy: -1219.3880013 hartree
pointgroup: C01 [X(C19H30N6O2)]
dipole: 3.1046072 0.2246157 1.0844675 debye
polarizability: 301.7793924|-26.9633845|352.7170491|36.9183007|23.4971103|185.0015225 unknown
InChI: InChI=1S/C19H30N6O2/c1-5-25(6-2)12-8-9-14(4)22-15-13-16(24-19(26)27-7-3)23-18-17(15)20-10-11-21-18/h10-11,13-14,22,24H,5-9,12H2,1-4H3
charge 0 multiplicity 1
57 atoms
O  -0.495944 -3.853591 -0.897256
O  -2.531376 -2.766659 -1.412798
N  3.352295 -1.134117 0.092979
N  0.76543 2.798586 0.86342
N  -2.193069 0.131749 -0.710363
N  -1.712054 3.750827 0.124855
N  -0.627359 -1.654556 -0.474596
N  -3.68833 1.950303 -0.929318
C  3.077556 2.012249 0.247855
C  4.269837 1.149151 0.750105
C  2.089054 2.411914 1.384389
C  4.467504 -0.148936 -0.069394
C  2.643723 3.552278 2.258744
C  3.252055 -2.049424 -1.089522
C  3.514676 -1.910211 1.363173
C  -0.144703 1.907027 0.357531
C  2.696951 -1.370058 -2.355184
C  2.217285 -2.576259 1.858684
C  -1.455524 2.408474 -0.030582
C  0.085451 0.530043 0.189042
C  -2.434924 1.478888 -0.556523
C  -0.965541 -0.289567 -0.341018
C  -2.939965 4.179442 -0.244939
C  -3.914041 3.272673 -0.769355
C  -1.369076 -2.724864 -0.973099
C  -1.102215 -5.146342 -1.317372
C  -1.848661 -5.806729 -0.154149
H  3.437445 2.933972 -0.249407
H  2.520261 1.437589 -0.512569
H  4.122431 0.887094 1.81814
H  5.214634 1.725611 0.710116
H  1.944272 1.512145 2.022732
H  4.531888 0.123944 -1.137863
H  5.446964 -0.617565 0.200229
H  0.440113 3.769589 0.922911
H  3.635462 3.280333 2.659289
H  1.975673 3.76914 3.111607
H  2.764574 4.476978 1.6625
H  2.577646 -2.882284 -0.81744
H  4.246522 -2.512051 -1.314412
H  3.865709 -1.208405 2.141925
H  4.316479 -2.683247 1.250477
H  2.575496 -2.118227 -3.159726
H  3.365752 -0.578641 -2.738387
H  1.71035 -0.915762 -2.157894
H  2.409879 -3.125404 2.798874
H  1.809827 -3.306432 1.135354
H  1.441473 -1.816348 2.064684
H  1.059322 0.07743 0.407408
H  0.314873 -1.910108 -0.168357
H  -3.16104 5.244986 -0.127843
H  -4.904396 3.637669 -1.065935
H  -0.239472 -5.746349 -1.650307
H  -1.780871 -4.956047 -2.167688
H  -2.710767 -5.191037 0.152978
H  -1.181515 -5.948476 0.714066
H  -2.227421 -6.798184 -0.465776
