program: Gaussian 09
title: 000277417
version: EM64L-G09RevD.01
frameworkgroup: C1[X(C10H6F15NO2)]
method: RPBEPBE
basis: SDD
operation: Freq
keyword: #p
keyword: freq=noraman
keyword: PBEPBE/SDD
title: #p freq=noraman PBEPBE/SDD
converged: YES YES NO NO
title: Mulliken charges:
elementType: F F F F F F F F F F F F F F F O O N C C C C C C C C C C H H H H H H
charge: -0.135360 -0.121376 -0.116157 -0.125900 -0.138207 -0.124156 -0.117146 -0.118183 -0.169879 -0.143953 -0.120771 -0.123172 -0.121404 -0.122626 -0.126392 -0.294135 -0.271268 -0.370546 0.252895 0.243218 0.229221 0.257551 0.307046 0.208786 -0.472139 0.373238 0.309595 -0.491598 0.280215 0.291271 0.345616 0.235495 0.247186 0.243035
chargesum: 0.00000
title: Mulliken charges with hydrogens summed into heavy atoms:
elementType: F F F F F F F F F F F F F F F O O N C C C C C C C C C C
charge: -0.135360 -0.121376 -0.116157 -0.125900 -0.138207 -0.124156 -0.117146 -0.118183 -0.169879 -0.143953 -0.120771 -0.123172 -0.121404 -0.122626 -0.126392 -0.294135 -0.271268 -0.024929 0.252895 0.243218 0.229221 0.257551 0.307046 0.208786 0.099347 0.373238 0.309595 0.234119
polarizability: 1.53641379e+02 -9.68957947e+00 1.29016650e+02 -3.47267324e+00 -1.38283189e+00 1.08462948e+02
1716.lowfreq: -1.1367 -0.0009 -0.0004 0.0006 3.8572 7.1365 17.3105 26.5168 32.7930
frequency: 16.9579 26.4608 32.7589 40.5295 43.1718 54.7924 62.7103 77.8437 82.7332 92.9067 115.5832 125.9438 129.9897 135.4853 145.3422 160.1001 174.2163 194.9831 199.3918 211.9286 233.4769 244.3273 248.3637 255.5552 256.6614 275.9864 278.6382 290.0048 290.1366 299.1485 305.4595 313.0322 317.5014 330.5312 335.6013 366.9625 398.5062 414.6476 426.0445 446.3877 463.5912 491.0847 514.4763 520.0259 558.6740 559.9066 572.2098 579.3101 586.9914 590.4580 638.4688 654.5828 698.3358 724.0181 810.2993 835.6071 859.1123 903.1590 916.2817 958.9599 978.5937 985.3607 1011.5754 1014.5012 1028.6456 1029.7893 1043.4939 1048.0721 1074.4186 1084.6713 1097.1984 1112.6166 1119.8692 1126.9793 1137.3091 1145.8875 1152.6330 1154.0185 1160.8017 1168.5267 1189.4374 1215.1351 1284.9265 1379.1316 1427.0615 1441.1411 1453.4356 1467.7209 1499.4293 1668.5480 3006.5624 3020.0112 3090.1171 3109.4917 3150.5593 3579.4867
redmass: 7.8387 9.2047 7.5650 13.4825 12.7193 7.4255 6.4131 6.7646 1.3375 11.8802 17.5396 8.2617 16.5655 8.1370 6.4383 9.1344 13.7050 15.6470 4.5273 17.6272 16.6084 14.9558 15.2650 7.7862 15.1548 15.7966 16.0404 15.0293 18.0435 16.5525 16.2720 8.6831 17.5144 18.4922 4.4022 6.6194 9.0816 11.7068 14.3642 14.8362 17.5167 6.7523 16.6428 6.6607 14.7134 9.7958 1.3683 6.2158 17.2363 16.1213 5.4086 17.1263 10.4336 7.4668 12.7481 3.4227 12.4672 7.1463 7.5437 12.1628 13.4715 7.7643 10.2783 10.4927 12.3461 12.8083 13.0367 11.8917 11.0694 13.1450 3.1451 11.5197 1.2760 9.5628 10.0130 10.6788 2.1035 3.5264 10.1019 5.7574 12.3371 2.0987 1.2319 1.3329 1.1545 1.0797 1.0496 1.0607 1.8702 8.5437 1.0297 1.0617 1.1015 1.1051 1.1047 1.0778
irintensity: 0.1844 0.0986 0.8427 0.7576 0.2457 0.3095 3.3429 0.7822 2.8982 0.7673 0.2474 4.7161 0.5730 4.7574 2.5828 1.9702 2.7222 13.0841 5.1663 10.8012 1.0207 0.4279 1.1582 2.3427 1.2824 2.7583 2.4026 4.2461 0.4056 0.7057 2.4752 9.7402 1.1817 0.4659 19.9495 1.9242 5.0819 6.3800 1.6635 1.5679 7.7895 11.7741 1.2562 17.6782 3.4860 25.9494 104.0537 23.0966 1.5979 2.6329 3.0283 44.4396 9.2808 100.3819 262.9421 4.8090 24.4169 81.3503 101.5560 66.2387 5.0767 63.2633 80.6142 135.6060 43.7463 77.2830 102.2183 48.0762 247.1580 312.2942 188.9717 7.3403 0.5189 20.0076 31.6673 29.8694 50.6023 25.1003 54.3333 44.3018 46.4750 205.4838 82.8311 24.8234 5.6731 20.7031 14.2932 38.3189 298.0624 230.6167 37.9330 20.4788 3.6334 26.2682 15.6500 52.6509
temp: 298.150 k
press: 1.00000 atm
elementType: 9 9 9 9 9 9 9 9 9 9 9 9 9 9 9 8 8 7 6 6 6 6 6 6 6 6 6 6 1 1 1 1 1 1
symmnumber: 1
zpe: 457831.9 jmol-1
zpe.correction: 0.174379 hartree
zpe.thermalcorrener: 0.203339 hartree
zpe.thermalcorrenthalpy: 0.204284 hartree
zpe.thermalcorrgfe: 0.112839 hartree
zpe.sumelectzpe: -2085.272520 hartree
zpe.sumelectthermal: -2085.243560 hartree
zpe.sumelectthermalent: -2085.242616 hartree
zpe.sumelectthermalfe: -2085.334060 hartree
dipole: 3.3472 0.5107 0.5076
dipole: 3.4238
quadrupole: -134.9745 -159.8615 -162.6772
quadrupole: -0.9528 -0.9740 4.8823
quadrupole: 17.5299 -7.3571 -10.1728 -0.9528 -0.9740 4.8823
hfenergy: -2085.4468993 hartree
pointgroup: C01 [X(C10H6F15N1O2)]
dipole: 1.3184592 0.1880272 0.2018963 debye
polarizability: 153.4903174|-9.8234499|129.1997498|-3.6453358|-1.050555|108.43091 unknown
InChI: InChI=1S/C10H6F15NO2/c1-28-3(27)26-2-4(11,12)5(13,14)6(15,16)7(17,18)8(19,20)9(21,22)10(23,24)25/h26H,2H2,1H3
charge 0 multiplicity 1
34 atoms
F  0.345318 0.832788 2.168975
F  -1.532764 1.711172 1.209919
F  0.277592 -1.361664 0.58228
F  -1.616141 -0.958151 1.789318
F  0.760042 2.98114 0.5950
F  -0.253674 2.011046 -1.209705
F  -1.019202 -0.585028 -1.771318
F  -1.926628 -2.305132 -0.579223
F  2.479486 2.176048 -1.337589
F  1.708208 0.031614 -1.303192
F  -3.057301 1.121814 -1.025872
F  -3.701792 -0.843377 -1.994553
F  -5.533958 -0.099707 -0.211414
F  -4.364693 -1.815898 0.699678
F  -4.031833 0.311535 1.429151
O  5.900051 -0.934953 -0.380966
O  4.0812 -1.729239 0.892071
N  4.207255 0.488541 0.118547
C  -0.388365 0.92559 0.95106
C  -0.875731 -0.546826 0.65049
C  0.515113 1.737756 -0.057477
C  -1.758572 -0.899941 -0.610413
C  1.916117 1.17024 -0.479251
C  -3.194148 -0.266137 -0.807748
C  2.91694 0.878649 0.65337
C  -4.290234 -0.477391 0.304126
C  4.667044 -0.812191 0.265715
C  6.517252 -2.277301 -0.292454
H  2.990905 1.785156 1.281182
H  2.549678 0.045165 1.275791
H  4.76588 1.144264 -0.428437
H  7.450266 -2.192187 -0.866593
H  5.848367 -3.035542 -0.732377
H  6.721521 -2.536755 0.759809
