program: Gaussian 09
title: 000270221
version: EM64L-G09RevD.01
frameworkgroup: C1[X(C17H21NO2)]
method: RPBEPBE
basis: SDD
operation: Freq
keyword: #p
keyword: freq=noraman
keyword: PBEPBE/SDD
title: #p freq=noraman PBEPBE/SDD
converged: YES YES NO NO
title: Mulliken charges:
elementType: O O N C C C C C C C C C C C C C C C C C H H H H H H H H H H H H H H H H H H H H H
charge: -0.274455 -0.270091 -0.287662 0.149562 -0.493069 0.149342 -0.001841 -0.424420 -0.499873 -0.409097 -0.014296 0.375285 0.153438 0.459325 -0.704995 -0.573721 -0.843091 -0.843815 -0.432222 -0.056614 0.217513 0.221477 0.207088 0.209471 0.227625 0.233908 0.211657 0.212006 0.227593 0.245905 0.211769 0.226870 0.229867 0.229485 0.234730 0.252458 0.270076 0.265866 0.236545 0.298860 0.171538
chargesum: 0.00000
title: Mulliken charges with hydrogens summed into heavy atoms:
elementType: O O N C C C C C C C C C C C C C C C C C
charge: -0.274455 -0.270091 0.011198 0.149562 -0.054079 0.149342 -0.001841 -0.007861 -0.038340 0.014567 -0.014296 0.375285 0.153438 0.459325 -0.477402 -0.116047 -0.156869 -0.086550 0.070189 0.114924
polarizability: 2.78862783e+02 -8.22035016e+00 2.08063764e+02 1.13464590e+01 3.07194979e+00 1.15175762e+02
1716.lowfreq: -9.7785 -6.8201 -0.0005 -0.0005 -0.0005 7.0789 27.5248 38.6899 42.5999
frequency: 27.4485 38.5910 42.5702 67.0989 87.6263 99.8810 111.1120 134.1122 149.0598 162.8798 168.2517 205.1519 242.6546 254.2479 266.9858 284.2631 299.2560 311.9880 323.2754 338.6616 368.4333 416.1261 430.0128 456.0204 462.9713 549.0074 549.9522 571.3825 579.5650 595.6119 619.2654 636.3647 677.0872 688.2306 717.4436 766.2355 776.1661 809.8996 823.8905 848.5005 878.1685 885.8357 908.5100 924.6487 952.3004 960.5605 962.3565 982.5715 1012.9362 1028.2649 1039.0781 1040.7474 1042.9468 1074.9299 1079.1073 1084.1171 1096.7767 1128.9248 1137.7585 1168.5978 1175.3503 1202.4838 1212.8243 1231.4398 1241.0550 1250.7903 1269.1077 1285.2721 1298.7733 1305.5475 1330.2832 1338.4461 1349.0280 1358.0488 1360.0452 1364.0233 1391.3301 1401.4136 1411.5146 1411.8766 1450.3105 1457.8619 1463.4910 1468.0487 1469.5669 1471.0521 1472.3305 1474.8306 1479.6675 1485.5610 1492.7231 1505.2845 1584.1308 1626.1768 1631.9586 1634.6921 2934.0861 2959.6411 2966.0869 2971.6832 2976.5137 2981.0740 2985.5530 2996.2644 3018.0379 3024.6282 3027.1665 3044.3888 3048.2610 3054.2071 3054.3154 3058.3936 3079.5001 3087.8885 3099.7404 3104.2443 3546.3327
redmass: 5.8229 5.0628 4.4789 4.4737 3.3013 2.6415 1.2416 1.2652 1.7692 2.8165 2.8911 2.7287 3.4396 2.8224 2.6081 2.5927 3.0446 2.3388 2.8703 3.4033 4.1437 4.4540 4.4330 3.3348 3.7329 2.8867 1.2639 4.0391 2.8521 5.0243 5.6287 3.9863 4.4623 3.3514 2.3012 4.9272 3.7907 1.6849 1.5172 2.4481 1.6372 2.2499 1.4891 2.7721 2.6727 1.9037 2.2642 2.6944 3.6736 2.0231 1.5859 1.5764 1.7026 2.4763 1.8791 2.3532 2.7648 1.4242 1.4541 1.5972 1.9052 2.1995 2.4131 1.3217 1.6263 1.4231 1.6784 1.4806 1.1700 2.2639 1.4208 1.4619 1.8245 1.7863 1.6513 1.3030 2.2813 1.7662 2.7184 1.5123 1.1624 1.1115 1.0865 1.0877 1.1290 1.0669 1.4438 1.1436 1.1153 1.1119 1.0763 4.3480 8.0046 8.0972 5.5471 7.3668 1.0867 1.0654 1.0636 1.0386 1.0412 1.0630 1.0628 1.0613 1.0608 1.0942 1.0938 1.0992 1.0966 1.1020 1.0969 1.0974 1.0986 1.1059 1.0992 1.0903 1.0786
irintensity: 2.0863 7.2040 6.7771 8.0272 0.8364 0.3847 0.5483 1.6679 1.9449 0.9602 1.6447 17.7154 0.1413 0.8043 6.7540 10.7584 3.0722 1.6189 0.0382 5.2861 5.1203 11.7888 22.8457 0.6388 0.5890 19.0627 68.4612 4.1733 1.5619 1.7896 2.7020 3.3350 3.6057 1.0709 3.3673 1.4583 1.7106 5.0931 5.0005 5.8347 11.6727 5.7265 0.8511 6.8795 3.1728 4.0205 4.7013 3.6207 12.4309 15.7040 1.5740 10.8484 7.6384 47.7268 9.6752 1.1836 9.4036 3.6140 2.4277 4.5618 17.9603 23.2570 38.8149 5.5656 3.5649 0.8036 3.9433 1.0896 10.1933 25.1545 2.8813 2.3442 9.2643 4.1481 11.5545 10.5126 8.0336 8.2689 10.6521 4.5172 35.1460 4.7746 13.0067 23.1469 13.7172 10.1900 73.0883 7.4903 32.4978 20.7919 7.0751 16.5810 0.9738 10.4404 160.2212 39.0909 162.2379 23.1651 37.9336 48.4111 18.3157 33.6734 33.6312 33.7060 28.1265 45.3314 10.4182 74.1665 21.6845 37.4288 40.3237 5.4231 22.8552 14.6994 4.8219 30.7651 14.2268
temp: 298.150 k
press: 1.00000 atm
elementType: 8 8 7 6 6 6 6 6 6 6 6 6 6 6 6 6 6 6 6 6 1 1 1 1 1 1 1 1 1 1 1 1 1 1 1 1 1 1 1 1 1
symmnumber: 1
zpe: 901510.4 jmol-1
zpe.correction: 0.343367 hartree
zpe.thermalcorrener: 0.362736 hartree
zpe.thermalcorrenthalpy: 0.363681 hartree
zpe.thermalcorrgfe: 0.294867 hartree
zpe.sumelectzpe: -864.150928 hartree
zpe.sumelectthermal: -864.131559 hartree
zpe.sumelectthermalent: -864.130615 hartree
zpe.sumelectthermalfe: -864.199428 hartree
dipole: 0.8169 4.4466 0.4183
dipole: 4.5403
quadrupole: -92.9834 -119.1407 -120.8937
quadrupole: -21.2917 0.9716 2.1362
quadrupole: 18.0225 -8.1347 -9.8878 -21.2917 0.9716 2.1362
hfenergy: -864.4942955 hartree
pointgroup: C01 [X(C17H21N1O2)]
dipole: 0.3138848 -1.7517076 -0.1543238 debye
polarizability: 278.8641196|7.8677071|208.0340953|-11.8366418|2.5064935|115.2040943 unknown
InChI: InChI=1S/C17H21NO2/c1-11-9-13(7-8-18-10-19)12(2)17-16(11)14-5-3-4-6-15(14)20-17/h9-10,18H,3-8H2,1-2H3
charge 0 multiplicity 1
41 atoms
O  1.351125 1.640871 0.164577
O  -5.199711 1.843276 -0.386536
N  -5.253793 -0.487061 -0.57855
C  2.638604 -0.274214 -0.066175
C  3.911729 -1.067391 -0.271831
C  2.651793 1.106172 -0.033595
C  1.249036 -0.685596 0.126506
C  5.03853 -0.144226 -0.811572
C  3.820029 2.028601 -0.174044
C  5.123446 1.191718 -0.028469
C  0.491883 0.516493 0.259613
C  0.563552 -1.931633 0.203745
C  -0.897303 0.600872 0.461138
C  -1.566527 -0.655314 0.537428
C  -0.832943 -1.873128 0.41066
C  -3.078214 -0.709692 0.699695
C  1.281583 -3.262308 0.068128
C  -1.591917 1.942333 0.615167
C  -3.791044 -0.641106 -0.685006
C  -5.839546 0.752693 -0.42601
H  4.234153 -1.52715 0.685623
H  3.745623 -1.904362 -0.975937
H  6.009277 -0.672673 -0.758689
H  4.846442 0.077359 -1.880603
H  3.796232 2.536279 -1.160219
H  3.780751 2.827691 0.590903
H  5.985457 1.787178 -0.382567
H  5.296868 0.972737 1.043728
H  -1.388015 -2.818118 0.48417
H  -3.440777 0.138407 1.306699
H  -3.378277 -1.640482 1.217516
H  1.679408 -3.407479 -0.95494
H  2.139054 -3.337714 0.762223
H  0.599782 -4.103671 0.281465
H  -1.829902 2.143438 1.678243
H  -0.938654 2.758208 0.265821
H  -2.545947 1.994347 0.06129
H  -3.406319 0.229538 -1.243159
H  -3.567687 -1.548754 -1.273981
H  -5.847914 -1.318025 -0.561834
H  -6.949769 0.699288 -0.347324
