program: Gaussian 09
title: 000270207
version: EM64L-G09RevD.01
frameworkgroup: C1[X(C15H16N2O)]
method: RPBEPBE
basis: SDD
operation: Freq
keyword: #p
keyword: freq=noraman
keyword: PBEPBE/SDD
title: #p freq=noraman PBEPBE/SDD
converged: YES YES NO NO
title: Mulliken charges:
elementType: O N N C C C C C C C C C C C C C C C H H H H H H H H H H H H H H H H
charge: -0.441689 -0.149592 -0.093723 0.409688 0.465578 -0.361735 -0.337559 -0.399321 -0.404806 -0.646082 -0.646465 -0.395921 0.302155 -0.536831 -0.409931 0.315999 -0.165978 -0.377992 0.237296 0.237886 0.221408 0.271374 0.236753 0.218796 0.237542 0.218047 0.238604 0.238518 0.210913 0.232278 0.250114 0.225124 0.249600 0.349953
chargesum: 0.00000
title: Mulliken charges with hydrogens summed into heavy atoms:
elementType: O N N C C C C C C C C C C C C C C C
charge: -0.091736 -0.149592 -0.093723 0.409688 0.465578 -0.124439 -0.099673 -0.177914 -0.133432 0.047009 0.048703 -0.185008 0.302155 -0.304553 -0.159817 0.315999 0.059146 -0.128391
polarizability: 4.37173603e+02 -1.13634551e+01 1.71218927e+02 -5.84752892e+00 -1.24015423e-01 9.29955960e+01
1716.lowfreq: -6.9022 -2.8163 -0.0007 -0.0005 -0.0004 3.5814 27.2491 35.2330 48.3035
frequency: 27.1729 35.2273 48.3024 74.5999 87.8540 113.0710 132.3599 164.3040 194.2298 210.9340 222.6270 251.5613 260.0794 296.4879 349.5044 373.7631 381.7515 396.7075 428.0457 452.9609 466.6988 499.2463 510.0160 517.9136 532.6742 600.9806 614.7938 633.3933 684.3450 713.5471 741.4944 755.6210 784.8616 806.7545 823.6340 830.3297 857.3839 883.3579 935.4406 941.1278 947.4677 968.8854 976.5420 982.0794 990.4985 994.7780 1056.1886 1069.3507 1105.9158 1110.6817 1120.7082 1131.9058 1153.3528 1164.7648 1169.0979 1191.2030 1240.1008 1257.9485 1270.2782 1305.0086 1316.9697 1358.5774 1367.4186 1379.7023 1393.2576 1429.3315 1431.7836 1448.5683 1458.5978 1464.5414 1476.3208 1486.0614 1491.4694 1505.3523 1532.5214 1550.2429 1581.6509 1593.7890 1617.9001 1634.1806 2928.2880 2944.2765 2952.0307 3011.3266 3015.7250 3098.8069 3108.8245 3109.3570 3113.2779 3137.4839 3145.9307 3166.0718 3167.1935 3169.7771 3178.5534 3580.5451
redmass: 4.3235 3.9812 5.0992 2.3167 4.6011 1.5755 5.2229 2.3225 1.1730 4.2409 4.2185 2.8139 3.3490 4.4981 1.1236 4.5000 3.7033 3.7689 3.0141 2.9841 3.7905 4.0322 5.1238 4.7091 2.6080 5.4612 4.9077 7.0646 1.9788 5.0947 3.3734 6.9084 1.3225 1.3253 2.0129 1.7455 3.3739 1.4801 1.8881 3.0690 1.9924 1.3269 2.5477 2.0365 1.5668 2.8742 1.5026 1.5950 1.2384 1.3257 1.6994 1.4931 1.2638 1.6156 1.2971 1.1500 2.3123 2.8910 1.8046 1.3908 1.5426 2.1382 3.9602 6.5508 2.7122 1.3362 2.7892 2.6950 1.2556 1.0403 1.0457 2.5243 1.1061 1.1421 2.8053 7.1013 6.0909 6.0630 6.4868 6.4187 1.0853 1.0368 1.0391 1.1001 1.1023 1.0965 1.0944 1.0907 1.0894 1.0873 1.0874 1.0936 1.0927 1.0948 1.0981 1.0659
irintensity: 0.6064 0.4286 0.5030 0.1254 1.7365 3.6592 0.4681 2.9171 0.0330 0.1036 1.0395 5.0112 1.9240 12.7630 139.9387 11.0468 4.6165 0.8475 0.6170 9.3956 10.9902 9.8330 5.4686 16.3524 21.9171 1.5767 0.7853 0.2797 29.6605 10.4869 4.4747 4.4719 26.7483 13.4392 21.6773 83.3423 16.9336 3.3005 54.7367 28.8011 29.6965 1.3199 3.1054 1.1143 11.8443 0.1815 26.2563 30.2844 0.0162 0.9956 207.1502 127.4121 30.1906 5.4877 12.4816 127.0244 13.4374 26.9978 8.2659 10.2211 25.5196 27.4505 282.6849 3.2706 2.3336 12.0565 40.3728 34.5858 14.8526 0.0676 22.9004 52.1578 7.3546 48.2903 375.6989 149.5638 619.4736 90.6537 26.7258 269.6138 60.2082 103.3251 151.4651 17.8321 65.2462 4.3015 49.7199 10.3309 11.7314 18.5870 3.1625 22.0660 7.3252 18.9348 13.7093 30.2779
temp: 298.150 k
press: 1.00000 atm
elementType: 8 7 7 6 6 6 6 6 6 6 6 6 6 6 6 6 6 6 1 1 1 1 1 1 1 1 1 1 1 1 1 1 1 1
symmnumber: 1
zpe: 718881.6 jmol-1
zpe.correction: 0.273808 hartree
zpe.thermalcorrener: 0.290802 hartree
zpe.thermalcorrenthalpy: 0.291746 hartree
zpe.thermalcorrgfe: 0.227862 hartree
zpe.sumelectzpe: -764.610081 hartree
zpe.sumelectthermal: -764.593087 hartree
zpe.sumelectthermalent: -764.592143 hartree
zpe.sumelectthermalfe: -764.656027 hartree
dipole: -6.9334 1.6703 0.1513
dipole: 7.1334
quadrupole: -85.0078 -94.1667 -110.8973
quadrupole: 0.0974 -2.3106 0.2829
quadrupole: 11.6828 2.5239 -14.2067 0.0974 -2.3106 0.2829
hfenergy: -764.8838889 hartree
pointgroup: C01 [X(C15H16N2O1)]
dipole: 2.7320014 0.2466478 0.5930005 debye
polarizability: 437.1151343|12.4809688|97.6811946|6.3848285|18.0882684|166.5917972 unknown
InChI: InChI=1S/C15H16N2O/c1-17(2)14-8-6-12(7-9-14)11-16-13-4-3-5-15(18)10-13/h3-11,18H,1-2H3
charge 0 multiplicity 1
34 atoms
O  -5.442238 1.075326 1.775353
N  5.244037 0.160614 -0.07352
N  -1.277389 -0.218652 -0.605739
C  3.857959 0.055931 0.043965
C  0.995128 -0.154555 0.278694
C  3.232358 -0.135566 1.31997
C  3.006478 0.137346 -1.111692
C  1.836841 -0.237641 1.422916
C  1.616482 0.034713 -0.99026
C  6.09351 0.068689 1.121631
C  5.861692 0.362242 -1.391835
C  -0.455995 -0.259601 0.42109
C  -2.683827 -0.229921 -0.428061
C  -3.335557 0.440435 0.64977
C  -3.472715 -0.893225 -1.408121
C  -4.744977 0.417713 0.74123
C  -4.87755 -0.917741 -1.285733
C  -5.529397 -0.265675 -0.215859
H  3.837908 -0.203889 2.227688
H  3.441257 0.280993 -2.104805
H  1.383774 -0.38604 2.412073
H  0.971241 0.097128 -1.872955
H  5.864009 0.871545 1.851295
H  7.150329 0.168674 0.829171
H  5.972946 -0.905715 1.636822
H  6.954846 0.428143 -1.277444
H  5.512015 1.29955 -1.869278
H  5.641011 -0.476609 -2.082219
H  -0.827508 -0.40225 1.460446
H  -2.740022 1.004041 1.381012
H  -2.961712 -1.381762 -2.242731
H  -5.477664 -1.441715 -2.037869
H  -6.618553 -0.258279 -0.118239
H  -4.811416 1.533855 2.384134
