program: Gaussian 09
title: 000270206
version: EM64L-G09RevD.01
frameworkgroup: C1[X(C14H12N2O4)]
method: RPBEPBE
basis: SDD
operation: Freq
keyword: #p
keyword: freq=noraman
keyword: PBEPBE/SDD
title: #p freq=noraman PBEPBE/SDD
converged: YES YES NO NO
title: Mulliken charges:
elementType: O O O O N N C C C C C C C C C C C C C C H H H H H H H H H H H H
charge: -0.255899 -0.442456 -0.218235 -0.207795 -0.070457 0.017341 0.128944 0.442338 -0.496577 0.230705 0.416896 -0.372350 -0.353601 0.328321 -0.379366 -0.326951 -0.371057 -0.358867 -0.342904 -0.537047 0.310565 0.226701 0.280074 0.272653 0.222847 0.288384 0.242568 0.254984 0.371075 0.224804 0.224649 0.249713
chargesum: 0.00000
title: Mulliken charges with hydrogens summed into heavy atoms:
elementType: O O O O N N C C C C C C C C C C C C C C
charge: -0.255899 -0.071381 -0.218235 -0.207795 -0.070457 0.017341 0.128944 0.442338 -0.186012 0.230705 0.416896 -0.145649 -0.073527 0.328321 -0.106714 -0.104104 -0.082672 -0.116299 -0.087920 0.162119
polarizability: 4.40848734e+02 -1.87596209e+00 2.01959500e+02 1.08931987e+00 1.60160055e+00 7.36663455e+01
1716.lowfreq: -7.2668 -0.0008 -0.0007 -0.0002 2.9110 5.9995 13.3640 33.2272 45.2740
frequency: 12.4497 33.2255 45.2529 57.0772 90.8907 106.5526 130.5802 150.8841 174.8782 182.5398 223.5562 234.2293 248.1051 290.3773 324.7026 345.8745 362.8985 370.7666 416.5064 424.5128 432.2104 458.9605 470.9168 520.8383 522.4932 556.4777 561.3319 621.3548 630.3498 639.6542 699.7842 729.6504 737.9033 747.4669 756.6355 766.8056 809.7491 812.3567 852.8325 854.0206 920.0057 939.9086 949.2039 953.6948 982.9676 991.9886 997.1109 1001.3899 1065.3318 1098.3794 1109.3897 1111.7598 1153.7894 1156.0516 1168.3187 1174.3978 1217.5770 1229.4636 1243.1026 1266.1514 1267.3156 1296.6316 1345.4152 1365.4197 1387.3023 1402.5224 1431.2710 1433.7266 1437.9711 1467.7418 1471.4539 1476.7741 1503.2292 1552.2274 1575.8909 1579.2813 1613.1088 1621.2743 2964.8332 3047.2552 3055.3478 3116.3323 3121.4052 3130.7489 3154.4983 3164.9493 3174.4798 3191.4624 3194.7256 3560.8911
redmass: 3.8679 5.4088 6.9936 8.7956 4.6173 6.8505 4.3225 6.6721 3.7140 2.9649 3.9807 1.5019 4.0356 5.5224 3.9895 9.5204 6.1348 4.5530 1.5292 1.9958 4.9881 6.8969 3.3716 5.8244 2.6231 4.5070 4.6558 7.5685 7.6248 7.1637 5.3636 3.6567 6.3988 3.7816 5.8033 8.2699 1.5513 1.3706 1.4903 4.7398 5.9606 1.3547 1.4570 1.3352 8.5205 1.4534 2.6087 1.4829 2.0189 1.9054 1.3257 1.2608 1.3125 1.2192 2.4388 1.4622 7.8614 2.5827 3.0100 1.7177 2.0535 1.3591 2.4992 7.4425 4.8606 3.4471 3.4948 2.0139 1.6682 1.0521 1.0877 2.7685 2.8129 7.5107 7.0146 7.0378 6.7911 6.4553 1.0328 1.0880 1.1042 1.0907 1.0893 1.0997 1.0879 1.0937 1.0974 1.0941 1.0924 1.0658
irintensity: 0.1660 1.7970 0.9787 0.5809 0.0780 1.3241 8.3016 1.8813 0.1875 0.3821 2.3233 1.2083 6.3549 8.0753 1.9433 0.2902 2.0249 0.3986 86.0577 53.7596 6.6774 8.4501 0.1512 37.7159 40.7121 13.7929 0.6924 0.9137 16.8017 14.8633 27.6954 0.3606 15.1401 0.7834 2.8842 5.1113 56.9831 9.2467 44.8244 11.4529 32.3473 7.8937 29.4833 0.5642 69.4415 8.9937 5.9272 12.3091 85.8835 87.6335 9.6202 0.4229 27.4114 1.8595 176.9257 94.4135 607.9785 169.8858 94.0226 44.1125 65.1551 33.0594 26.1728 88.9827 13.5015 13.9793 79.6475 26.2486 29.5004 17.7549 48.0880 13.8216 122.2221 453.0997 12.4580 44.1025 132.0220 148.0694 95.4334 10.7905 44.6797 19.0434 13.1543 22.5309 1.0308 20.1416 8.9383 4.5026 7.2443 51.9074
temp: 298.150 k
press: 1.00000 atm
elementType: 8 8 8 8 7 7 6 6 6 6 6 6 6 6 6 6 6 6 6 6 1 1 1 1 1 1 1 1 1 1 1 1
symmnumber: 1
zpe: 617531.0 jmol-1
zpe.correction: 0.235205 hartree
zpe.thermalcorrener: 0.253005 hartree
zpe.thermalcorrenthalpy: 0.253949 hartree
zpe.thermalcorrgfe: 0.187075 hartree
zpe.sumelectzpe: -949.557423 hartree
zpe.sumelectthermal: -949.539623 hartree
zpe.sumelectthermalent: -949.538679 hartree
zpe.sumelectthermalfe: -949.605553 hartree
dipole: 5.8639 7.7981 0.0535
dipole: 9.7570
quadrupole: -108.3825 -104.9660 -119.2014
quadrupole: -19.2330 1.8979 0.3410
quadrupole: 2.4675 5.8840 -8.3514 -19.2330 1.8979 0.3410
hfenergy: -949.792628 hartree
pointgroup: C01 [X(C14H12N2O4)]
dipole: 2.2301992 2.3458523 2.0636911 debye
polarizability: 438.6761749|-14.546295|152.4804311|24.0968548|61.6455559|125.3179734 unknown
InChI: InChI=1S/C14H12N2O4/c1-20-12-5-2-10(3-6-12)9-15-13-8-11(16(18)19)4-7-14(13)17/h2-9,17H,1H3
charge 0 multiplicity 1
32 atoms
O  6.04841 -1.129054 -0.377739
O  -1.381073 2.281374 1.577458
O  -6.13111 -0.925225 -1.241284
O  -4.335165 -2.133245 -1.963295
N  -0.305755 0.009188 -0.030578
N  -4.85921 -1.160306 -1.294443
C  -1.665766 0.350741 0.119447
C  2.078609 0.14226 0.358838
C  -2.570319 -0.484463 -0.587718
C  -2.245445 1.436382 0.870904
C  -3.959021 -0.261059 -0.545026
C  3.146435 0.761419 1.062209
C  2.386796 -0.893263 -0.575889
C  4.767864 -0.655914 -0.080826
C  0.700767 0.576678 0.605844
C  -3.645457 1.651469 0.895369
C  -4.51853 0.806923 0.192415
C  4.485811 0.374257 0.853523
C  3.710666 -1.287949 -0.794863
C  7.18465 -0.525925 0.3273
H  -2.158226 -1.310227 -1.171828
H  2.923378 1.557944 1.783476
H  1.558021 -1.365469 -1.112111
H  0.567748 1.386129 1.342766
H  -4.051824 2.489368 1.47728
H  -5.600848 0.953481 0.201669
H  5.287241 0.868444 1.410313
H  3.964828 -2.078847 -1.506988
H  -1.88259 3.006374 2.02886
H  7.105199 -0.680826 1.420504
H  7.264195 0.556013 0.107116
H  8.07062 -1.049972 -0.059002
