program: Gaussian 09
title: 000277385
version: EM64L-G09RevD.01
frameworkgroup: C1[X(C12H11NO6)]
method: RPBEPBE
basis: SDD
operation: Freq
keyword: #p
keyword: freq=noraman
keyword: PBEPBE/SDD
title: #p freq=noraman PBEPBE/SDD
converged: YES YES NO NO
title: Mulliken charges:
elementType: O O O O O O N C C C C C C C C C C C C H H H H H H H H H H H
charge: -0.273019 -0.231788 -0.201417 -0.182895 -0.233353 -0.245901 0.018041 0.314549 0.199885 -0.308247 -0.346830 -0.365046 0.177692 -0.245464 -0.207920 0.171200 0.135878 -0.501542 -0.502502 0.288923 0.304834 0.287885 0.245798 0.245986 0.247642 0.234941 0.244790 0.242084 0.246646 0.239152
chargesum: 0.00000
title: Mulliken charges with hydrogens summed into heavy atoms:
elementType: O O O O O O N C C C C C C C C C C C C
charge: -0.273019 -0.231788 -0.201417 -0.182895 -0.233353 -0.245901 0.018041 0.314549 0.199885 -0.019325 -0.041997 -0.077162 0.177692 0.000335 0.038066 0.171200 0.135878 0.225831 0.225380
polarizability: 2.46813230e+02 -1.05894867e+01 1.67348004e+02 -3.10933723e-01 -1.78544750e+01 1.05067696e+02
1716.lowfreq: -2.1145 -0.0009 -0.0008 -0.0003 3.9212 4.4563 22.3976 29.4999 51.4683
frequency: 22.3628 29.4469 51.4675 53.3059 68.3911 81.9974 91.8245 99.7072 108.4584 127.1976 141.9908 178.4761 188.5626 218.0114 224.1786 272.5453 290.0832 305.1368 363.4360 386.7449 389.2769 430.6778 474.5610 518.9449 550.2874 581.7171 605.8478 645.0705 668.0921 677.6699 711.2075 734.7218 752.6477 774.4376 784.8334 791.6834 826.3705 895.8151 902.7202 927.4733 945.6669 986.5843 1007.0757 1027.7224 1044.8390 1061.4787 1109.2980 1114.2045 1138.3076 1147.2385 1150.8718 1165.4367 1174.8217 1195.8234 1205.9760 1234.4455 1299.3122 1345.1808 1366.6773 1385.1880 1420.1799 1423.3823 1434.0879 1452.4495 1453.2037 1460.8087 1462.5108 1472.1686 1568.7082 1600.9747 1607.6061 1621.4184 1644.3669 3006.6673 3007.2868 3109.2889 3111.0157 3119.5153 3145.6487 3153.5571 3155.4098 3162.4926 3173.5496 3187.5639
redmass: 6.3722 6.6055 5.0873 9.1554 4.5208 4.8654 1.6704 1.2292 1.8133 4.0136 4.8684 5.0500 5.0089 6.2891 6.4933 6.4957 4.2847 6.1496 5.1001 8.3989 7.0430 4.0517 5.8456 6.0802 5.6847 5.3195 6.0832 6.9405 5.5739 7.2400 4.3908 5.0137 7.6632 6.6665 3.6804 1.7418 6.2019 2.2454 2.1427 1.5603 7.7377 1.3710 1.3424 5.1015 3.8179 2.6864 1.2682 1.2654 2.3211 1.4531 1.5053 3.6513 1.3307 2.0681 7.0735 3.2377 1.6718 2.6803 3.9708 3.7486 1.2183 1.1876 2.5719 1.0496 1.0503 1.0509 1.0538 2.4334 6.0020 8.4247 7.1670 10.2264 9.8398 1.0295 1.0294 1.1047 1.1047 1.0880 1.0873 1.1048 1.1049 1.0919 1.0969 1.0973
irintensity: 0.9524 2.9915 2.0130 1.3314 0.2101 1.6044 0.6519 0.3701 0.5304 2.0034 1.8297 4.4539 0.5104 0.2969 1.0825 21.3154 28.4528 3.2733 2.9812 1.0499 7.7262 0.6946 6.2378 3.6804 6.8687 4.0544 5.1411 2.1918 17.0883 32.8291 1.2458 14.7341 2.8090 19.8562 24.9959 36.4687 11.8392 2.2908 6.4748 6.0999 24.4477 6.7249 2.4758 62.1609 31.4815 6.8220 0.2922 0.0515 51.7579 4.5739 44.4572 451.9207 56.4368 169.9770 232.8041 154.5483 0.8401 95.9089 82.1511 7.3321 15.6177 29.0062 3.4201 17.3346 9.6925 11.9641 15.4711 66.3038 26.1202 170.0361 45.6212 109.6733 73.0213 36.1685 29.9119 22.2677 20.3735 3.5910 4.7021 15.4793 12.7775 5.4249 9.9414 7.0293
temp: 298.150 k
press: 1.00000 atm
elementType: 8 8 8 8 8 8 7 6 6 6 6 6 6 6 6 6 6 6 6 1 1 1 1 1 1 1 1 1 1 1
symmnumber: 1
zpe: 562289.1 jmol-1
zpe.correction: 0.214165 hartree
zpe.thermalcorrener: 0.232990 hartree
zpe.thermalcorrenthalpy: 0.233934 hartree
zpe.thermalcorrgfe: 0.164365 hartree
zpe.sumelectzpe: -968.480788 hartree
zpe.sumelectthermal: -968.461963 hartree
zpe.sumelectthermalent: -968.461019 hartree
zpe.sumelectthermalfe: -968.530588 hartree
dipole: 0.9430 5.0900 -0.3342
dipole: 5.1873
quadrupole: -85.6229 -115.8767 -107.9448
quadrupole: -13.5807 9.2497 7.4280
quadrupole: 17.5252 -12.7285 -4.7967 -13.5807 9.2497 7.4280
hfenergy: -968.6949529 hartree
pointgroup: C01 [X(C12H11N1O6)]
dipole: -0.0410012 -2.0237914 0.2601701 debye
polarizability: 247.935282|2.4462795|170.4975734|5.4916594|4.995877|100.7960752 unknown
InChI: InChI=1S/C12H11NO6/c1-18-11(14)9(12(15)19-2)7-8-5-3-4-6-10(8)13(16)17/h3-7H,1-2H3
charge 0 multiplicity 1
30 atoms
O  -3.64416 -0.119952 -0.550129
O  -1.810523 -1.147541 1.616085
O  3.191556 3.004925 0.612915
O  0.938542 2.67779 0.578684
O  -2.583495 1.75968 -1.438871
O  -1.241728 -2.493924 -0.195472
N  2.152957 2.264545 0.4108
C  1.279509 0.045924 -0.458432
C  2.369792 0.858766 -0.018933
C  -0.081603 0.572357 -0.691292
C  1.589092 -1.304946 -0.791495
C  3.690758 0.370161 0.077067
C  -1.273663 -0.044107 -0.421422
C  2.903593 -1.805421 -0.690424
C  3.960426 -0.969468 -0.260206
C  -2.522805 0.651458 -0.855729
C  -1.427946 -1.355686 0.299943
C  -4.948572 0.461881 -0.945251
C  -2.077221 -2.373353 2.411225
H  -0.16977 1.55863 -1.165466
H  0.787076 -1.953391 -1.154978
H  4.475484 1.047319 0.423581
H  3.101772 -2.848545 -0.95782
H  4.98126 -1.356591 -0.184848
H  -5.10219 1.427338 -0.434974
H  -5.693976 -0.279862 -0.627424
H  -4.980287 0.618226 -2.036545
H  -1.171155 -2.999963 2.461519
H  -2.895854 -2.949264 1.948613
H  -2.361469 -2.001986 3.405078
