program: Gaussian 09
title: 000270193
version: EM64L-G09RevD.01
frameworkgroup: C1[X(C14H17NO4)]
method: RPBEPBE
basis: SDD
operation: Freq
keyword: #p
keyword: freq=noraman
keyword: PBEPBE/SDD
title: #p freq=noraman PBEPBE/SDD
converged: YES YES NO NO
title: Mulliken charges:
elementType: O O O O N C C C C C C C C C C C C C C H H H H H H H H H H H H H H H H H
charge: -0.256439 -0.225588 -0.225918 -0.261543 0.026551 -0.502105 -0.435171 0.395011 -0.322219 -0.425559 0.422682 -0.345304 -0.381225 0.432062 -0.447497 -0.371645 -0.803595 0.302535 -0.753424 0.239896 0.251855 0.252207 0.252226 0.243165 0.232264 0.273623 0.259236 0.238783 0.246577 0.236467 0.239288 0.229671 0.233475 0.250062 0.254212 0.245384
chargesum: 0.00000
title: Mulliken charges with hydrogens summed into heavy atoms:
elementType: O O O O N C C C C C C C C C C C C C C
charge: -0.256439 -0.225588 -0.225918 -0.261543 0.026551 -0.010353 0.069261 0.395011 0.153210 -0.151937 0.422682 -0.086067 -0.142443 0.432062 -0.200920 -0.135178 -0.101161 0.302535 -0.003767
polarizability: 2.93857236e+02 -1.89410072e+01 1.82240942e+02 -2.94008296e-01 2.98966068e+00 1.03467268e+02
1716.lowfreq: -34.7553 -6.4904 -0.0004 -0.0003 -0.0002 3.7092 9.1431 23.3294 29.3803
frequency: -34.5508 23.2896 29.2866 41.6419 49.4740 55.8172 64.3592 71.2809 71.8842 110.3473 167.8421 173.3401 189.6786 208.8847 244.6925 268.5832 299.8774 341.6870 358.0924 375.9415 394.6277 412.7082 468.9906 471.1830 514.4390 527.6727 569.3712 582.0210 627.5475 636.9809 661.7970 690.2743 725.9071 735.3818 771.4029 778.9791 820.4734 840.8588 845.4344 854.1189 871.4033 906.1098 944.0011 972.9925 984.5501 987.1230 989.2465 1005.3120 1010.9585 1034.2003 1044.8873 1046.9704 1079.7904 1108.7856 1132.6442 1177.2934 1197.4203 1202.5158 1211.9626 1230.2446 1236.4021 1241.3548 1299.4477 1306.0792 1315.6422 1346.5223 1356.4568 1362.7071 1369.6539 1384.7397 1388.4453 1397.2024 1415.0161 1449.7809 1453.5937 1456.1878 1460.3247 1468.1727 1470.7372 1473.4915 1506.2141 1564.4046 1616.7404 1637.7132 1639.5168 2978.7694 3002.8667 3004.9799 3014.8714 3027.2153 3056.6760 3061.6069 3081.8240 3090.3510 3097.7328 3107.7351 3109.1155 3120.3612 3131.8141 3140.3582 3143.9532 3186.3811
redmass: 1.0305 4.1916 4.3716 1.1663 4.1005 5.4454 5.2158 8.0128 4.0648 5.8525 4.5896 5.3339 3.6400 3.2830 6.7207 2.5752 2.8350 3.5207 2.7495 3.5738 3.6887 2.8828 4.4143 3.4858 3.2421 4.2956 3.2235 4.4690 5.2424 4.4665 3.7258 7.3737 3.0348 2.5169 4.5011 2.7334 1.7174 4.6146 2.0568 1.3241 2.3261 3.0190 1.4105 1.3844 1.4952 1.3943 2.0303 2.6484 2.6258 2.4437 1.6517 1.5817 2.9502 2.0879 1.4016 5.8646 1.4251 1.9581 1.6283 3.1525 1.1806 1.9569 1.1475 1.2770 1.3708 2.6036 1.7093 1.3675 4.1687 1.2411 2.0012 1.2715 3.1622 1.0905 1.0712 1.0603 1.1019 1.0465 1.1155 1.0999 2.6398 5.3662 6.3241 8.6252 8.1963 1.0376 1.0394 1.0604 1.0605 1.0597 1.0969 1.0983 1.1029 1.0989 1.0927 1.0875 1.1067 1.0872 1.0907 1.1026 1.0971 1.0929
irintensity: 0.5274 1.3516 0.8763 0.4484 0.1369 2.4684 1.3264 0.1482 2.2906 4.6108 4.5119 0.2854 3.7195 4.6125 1.0760 3.9976 6.0601 0.0833 0.2314 2.6357 4.9416 1.8996 12.6654 2.7839 11.5849 10.9229 4.8590 8.1186 5.6519 2.0502 2.0799 9.5720 4.0809 13.8670 1.2577 17.6656 25.4711 18.4291 15.9115 6.9843 7.3591 22.4610 28.8753 11.8837 0.4455 4.3279 10.3963 9.6671 25.1036 51.6085 14.4700 15.5795 11.6348 18.8739 16.0512 477.7689 109.3384 133.6611 55.1311 0.5524 20.5096 7.5634 5.2487 2.7559 10.0680 62.5651 21.9826 8.1003 56.1278 49.7170 1.4514 9.6538 5.7171 13.7072 21.4348 16.0820 1.6874 12.4691 16.9448 34.0810 16.7271 1.3022 142.0788 118.5498 92.1251 27.0648 1.7632 0.9769 14.9947 41.4416 16.5499 2.3220 11.5559 17.2968 11.4983 0.8746 15.3434 8.1759 16.0590 5.8180 20.4457 0.7856
temp: 298.150 k
press: 1.00000 atm
elementType: 8 8 8 8 7 6 6 6 6 6 6 6 6 6 6 6 6 6 6 1 1 1 1 1 1 1 1 1 1 1 1 1 1 1 1 1
symmnumber: 1
zpe: 748789.0 jmol-1
zpe.correction: 0.285199 hartree
zpe.thermalcorrener: 0.304056 hartree
zpe.thermalcorrenthalpy: 0.305000 hartree
zpe.thermalcorrgfe: 0.234889 hartree
zpe.sumelectzpe: -897.840086 hartree
zpe.sumelectthermal: -897.821229 hartree
zpe.sumelectthermalent: -897.820284 hartree
zpe.sumelectthermalfe: -897.890395 hartree
dipole: -5.2745 3.0588 -1.5442
dipole: 6.2898
quadrupole: -108.2884 -117.2550 -115.8712
quadrupole: 16.7648 3.5783 -3.4807
quadrupole: 5.5165 -3.4501 -2.0663 16.7648 3.5783 -3.4807
hfenergy: -898.1252845 hartree
pointgroup: C01 [X(C14H17N1O4)]
dipole: 2.4045825 0.2917197 0.5064407 debye
polarizability: 288.9232931|-29.8767223|185.9084334|-4.761695|-9.1250361|104.7337188 unknown
InChI: InChI=1S/C14H17NO4/c1-11-5-7-13(8-6-11)10-14(15(17)18)4-3-9-19-12(2)16/h5-8,10H,3-4,9H2,1-2H3
charge 0 multiplicity 1
36 atoms
O  -0.28679 3.417449 0.342287
O  -4.241042 -0.016344 0.414162
O  -3.777673 -2.242017 0.256773
O  1.117061 2.850333 -1.433028
N  -3.403955 -1.006186 0.347565
C  -1.652672 0.799132 0.562075
C  -1.729072 1.637958 -0.742908
C  -1.951635 -0.665385 0.364143
C  -1.494044 3.13685 -0.501653
C  -1.090691 -1.729289 0.257506
C  0.372766 -1.737727 0.187728
C  1.174632 -0.644395 -0.256039
C  1.04386 -2.947648 0.545246
C  3.243025 -1.947133 0.079842
C  2.577806 -0.754711 -0.308756
C  2.445095 -3.043962 0.507121
C  4.753595 -2.064885 0.013371
C  0.964149 3.238219 -0.249892
C  2.070815 3.543795 0.736876
H  -0.650716 0.893786 1.014522
H  -2.380574 1.211257 1.284502
H  -2.7420 1.533684 -1.176582
H  -1.009642 1.263518 -1.491516
H  -1.378119 3.671568 -1.461221
H  -2.308329 3.585745 0.089896
H  -1.576929 -2.715164 0.235581
H  0.711711 0.276352 -0.61802
H  0.448592 -3.810641 0.867756
H  3.163728 0.094548 -0.679765
H  2.931826 -3.981991 0.800164
H  5.061713 -2.809057 -0.745674
H  5.224758 -1.103018 -0.249885
H  5.173748 -2.39836 0.980389
H  2.3086 2.630926 1.31448
H  1.761881 4.324478 1.448563
H  2.976121 3.853215 0.192792
