program: Gaussian 09
title: 000270191
version: EM64L-G09RevD.01
frameworkgroup: C1[X(C9H9NO4)]
method: RPBEPBE
basis: SDD
operation: Freq
keyword: #pfreq=noraman
keyword: PBEPBE/SDD
title: #p freq=noraman PBEPBE/SDD
converged: YES YES NO NO
title: Mulliken charges:
elementType: O O O O N C C C C C C C C C H H H H H H H H H
charge: -0.258011 -0.238402 -0.207755 -0.209803 0.026314 0.462188 -0.638532 -0.321925 -0.394668 0.371831 -0.351951 -0.347605 0.278927 -0.504164 0.255256 0.250078 0.276844 0.246218 0.287022 0.286955 0.247849 0.237751 0.245582
chargesum: 0.00000
title: Mulliken charges with hydrogens summed into heavy atoms:
elementType: O O O O N C C C C C C C C C
charge: -0.258011 -0.238402 -0.207755 -0.209803 0.026314 0.462188 -0.133198 -0.045081 -0.148451 0.371831 -0.064929 -0.060650 0.278927 0.227018
polarizability: 1.75563526e+02 3.90588318e+00 1.19672451e+02 1.17983468e+01 -3.43041094e+00 6.98236365e+01
1716.lowfreq: -4.2839 -0.0014 -0.0012 -0.0010 3.8765 10.1816 16.7818 27.6677 62.9309
frequency: 15.7851 27.1038 62.9192 70.3574 89.4153 121.5887 186.4017 195.3887 252.1600 283.6744 321.0586 352.8993 399.9278 409.7861 478.0461 506.0590 559.1385 622.5793 635.4453 665.8007 699.7450 731.7173 770.5455 809.4017 822.1799 852.6529 878.7267 933.7804 969.2826 988.2827 997.2022 1007.5869 1092.8008 1099.9307 1113.5854 1121.2372 1149.7416 1183.6287 1204.8203 1219.4612 1227.9673 1289.8049 1313.1439 1367.0758 1402.2727 1419.8039 1424.1092 1451.9485 1452.8105 1462.4778 1482.2642 1598.0519 1607.3158 1642.9790 3008.3200 3009.1566 3102.6328 3113.3355 3143.5023 3156.0462 3156.8822 3183.2407 3185.6990
redmass: 4.7449 5.4450 6.6486 6.1073 1.1280 5.5276 4.8838 6.7490 3.9012 5.3706 4.4815 5.5294 3.1538 2.8897 3.5642 7.2631 5.1864 6.4579 5.6565 5.1443 4.9580 4.7359 6.4810 4.0894 3.5078 1.2704 2.1545 2.4887 3.7485 1.4252 1.3722 3.1285 3.0919 1.7000 1.2700 1.4625 1.4350 1.3530 2.7977 2.7598 2.3014 1.4969 1.5050 7.2721 7.8734 1.7129 1.7040 1.1208 1.0533 1.0514 2.3653 7.7620 6.2192 9.0350 1.0628 1.0306 1.0973 1.1049 1.0908 1.1052 1.0906 1.0946 1.0959
irintensity: 1.4823 0.8256 1.0956 0.2889 0.6744 1.6571 5.8945 5.4624 9.0835 6.6956 2.2214 11.1893 1.8581 0.0456 8.7286 0.7505 11.7318 1.2903 3.7624 18.4385 19.4946 9.2940 23.9338 12.0461 17.6033 0.6745 37.2175 7.2167 26.6200 8.8183 1.0548 7.4520 8.4987 113.3999 0.3057 133.9436 8.2510 54.8939 2.0531 350.7578 54.7012 48.8251 46.0774 103.2166 1.1468 43.8983 24.5123 25.0592 10.5884 13.5388 11.1839 3.6761 60.1247 153.8574 5.9660 27.6004 5.0616 23.5780 8.7840 13.7206 0.4298 0.2426 3.1461
temp: 298.150 k
press: 1.00000 atm
elementType: 8 8 8 8 7 6 6 6 6 6 6 6 6 6 1 1 1 1 1 1 1 1 1
symmnumber: 1
zpe: 443232.5 jmol-1
zpe.correction: 0.168818 hartree
zpe.thermalcorrener: 0.182030 hartree
zpe.thermalcorrenthalpy: 0.182974 hartree
zpe.thermalcorrgfe: 0.125966 hartree
zpe.sumelectzpe: -702.898642 hartree
zpe.sumelectthermal: -702.885431 hartree
zpe.sumelectthermalent: -702.884487 hartree
zpe.sumelectthermalfe: -702.941495 hartree
dipole: -6.1429 -2.0032 -0.8949
dipole: 6.5230
quadrupole: -94.5101 -81.4169 -77.0280
quadrupole: 2.0765 -7.8673 0.4607
quadrupole: -10.1918 2.9014 7.2903 2.0765 -7.8673 0.4607
hfenergy: -703.0674606 hartree
pointgroup: C01 [X(C9H9N1O4)]
dipole: -2.4311909 0.4610815 0.6802743 debye
dipolederiv: -1.1288312 0.3185109 -0.3176865 0.5159801 -0.6701212 0.1474585 -0.5078252 0.0855558 -0.504291 -0.6365166 -0.0529591 -0.1398831 0.1759543 -0.8312267 -0.0214202 -0.158871 -0.2462198 -0.4383571 -0.6962711 0.1473351 0.1803845 0.1748467 -0.6174887 -0.1557451 0.2127371 -0.157779 -0.3352435 -0.7305698 -0.2265785 0.0868121 -0.2619381 -0.6629611 -0.0433049 0.1047939 -0.0406904 -0.2733614 1.7357769 0.1116657 -0.4395394 0.1149928 1.0368845 0.1963054 -0.5165222 0.1929275 0.3989048 0.6713566 0.0751676 -0.0826688 0.0266839 0.0764921 -0.0200127 -0.3000856 -0.0215515 -0.0304787 -0.4576199 -0.0752471 -0.1433299 -0.1588569 0.0567519 0.0196368 -0.1587755 -0.043103 -0.0461238 -0.3059497 0.1466541 0.066399 0.2459534 0.0113015 -0.0214411 0.149658 0.0181338 -0.1587631 -0.362311 -0.163947 -0.0269841 -0.2221412 0.012494 0.1148596 0.0199201 0.0963208 -0.0965357 -0.6784472 -0.0398992 0.1962056 -0.0191311 0.0294806 0.0039568 0.2468444 0.0088857 -0.0205609 0.1664267 -0.083023 -0.1032066 0.1822603 -0.0185676 -0.0417223 -0.0358417 0.054393 -0.0692927 0.174644 0.117299 -0.0495686 -0.1848662 -0.0456178 0.0586983 -0.1346548 -0.0267835 -0.0572837 1.3137393 -0.2655134 0.4860769 -0.5976091 1.1946718 -0.0886002 0.7765989 0.2158889 0.5606954 0.5369164 -0.04962 0.1220558 0.0308058 0.2269578 -0.0206675 0.2263287 -0.0719114 0.3787475 0.0300623 -0.0056263 0.0137742 -0.0205812 0.0188739 0.0879178 0.0251503 0.0505572 0.0210716 0.0513039 0.0040023 0.0084024 0.0548204 -0.0362037 -0.084499 0.0075942 -0.0443245 0.0770059 0.1018052 -0.0707323 0.0240055 -0.0691833 0.0309298 -0.0125913 0.0119819 -0.0225221 0.1298927 0.0405799 0.0725841 0.0636107 0.0679287 -0.0023505 -0.0603635 0.0531431 -0.0644588 0.1079922 0.1045002 0.0469484 0.0312866 0.0171812 0.0722452 -0.0333796 0.0299083 -0.0432313 0.1482296 0.0984186 -0.0631453 0.0028251 -0.0313533 0.0622553 -0.0183511 0.0145962 -0.0084835 0.1643757 -0.0234186 0.024238 0.0820213 -0.0155125 0.100797 -0.0589115 -0.0122844 -0.0008452 -0.0815165 0.0124512 0.07973 -0.0426797 0.124584 -0.035562 0.0221933 -0.0398881 -0.0063806 0.0961896 -0.0180461 -0.0478439 -0.018313 -0.1508187 -0.0100361 0.0299834 -0.0145063 0.0756219 0.0287031 unknown
polarizability: 174.402556|4.6164615|115.9765229|-16.2110553|13.0312873|74.6805345 unknown
InChI: InChI=1S/C9H9NO4/c1-14-9(11)6-7-2-4-8(5-3-7)10(12)13/h2-5H,6H2,1H3
charge 0 multiplicity 1
23 atoms
O  -3.891731 0.502072 -0.063265
O  -3.022671 -1.64529 -0.309474
O  4.009953 -0.88008 -1.007111
O  4.092548 1.323595 -0.424307
N  3.476351 0.192445 -0.524152
C  -0.591644 -0.015303 0.836536
C  -2.03094 -0.085247 1.34018
C  0.041294 -1.163731 0.289101
C  0.13329 1.200873 0.921663
C  2.070521 0.121356 -0.055856
C  1.373696 -1.10294 -0.159663
C  1.468359 1.280329 0.478285
C  -3.004247 -0.524696 0.247726
C  -4.88328 0.196131 -1.128313
H  -2.100817 -0.835908 2.150514
H  -2.353398 0.887404 1.741397
H  -0.52334 -2.097735 0.203604
H  -0.350278 2.091921 1.336716
H  1.879083 -1.974346 -0.583951
H  2.043029 2.208303 0.536238
H  -4.363074 -0.033987 -2.072787
H  -5.48719 1.109249 -1.217684
H  -5.502814 -0.667113 -0.833794
