program: Gaussian 09
title: 000277409
version: EM64L-G09RevD.01
frameworkgroup: C1[X(C20H34N2O2)]
method: RPBEPBE
basis: SDD
operation: Freq
keyword: #p
keyword: freq=noraman
keyword: PBEPBE/SDD
title: #p freq=noraman PBEPBE/SDD
converged: YES YES NO NO
title: Mulliken charges:
elementType: O O N N C C C C C C C C C C C C C C C C C C C C H H H H H H H H H H H H H H H H H H H H H H H H H H H H H H H H H H
charge: -0.275459 -0.275459 -0.115271 -0.115270 -0.081102 -0.086788 -0.081103 -0.086785 -0.476069 -0.434746 -0.448141 -0.416579 -0.434742 -0.476076 -0.416576 -0.448152 -0.396654 -0.398174 -0.396652 -0.398169 0.007246 0.007250 -0.341955 -0.341954 0.200837 0.195804 0.200837 0.195806 0.207370 0.205410 0.215661 0.198978 0.209381 0.203828 0.195756 0.200006 0.198977 0.215658 0.207372 0.205413 0.195760 0.200003 0.203827 0.209384 0.193879 0.213191 0.205464 0.197356 0.213188 0.193879 0.197354 0.205460 0.210001 0.209999 0.183204 0.227566 0.227566 0.183204
chargesum: 0.00000
title: Mulliken charges with hydrogens summed into heavy atoms:
elementType: O O N N C C C C C C C C C C C C C C C C C C C C
charge: -0.275459 -0.275459 -0.115271 -0.115270 0.119735 0.109016 0.119734 0.109021 -0.063289 -0.020106 -0.034932 -0.020817 -0.020107 -0.063291 -0.020813 -0.034941 0.010416 0.004645 0.010415 0.004645 0.217247 0.217249 0.068815 0.068815
polarizability: 2.90612848e+02 -3.91226024e+00 1.98853685e+02 -4.24555402e-01 -1.05064170e+00 1.92083653e+02
1716.lowfreq: -13.6153 -12.7445 -8.2000 -3.9693 -0.0008 0.0005 0.0009 10.2877 18.9573
frequency: -12.7445 10.2877 18.3006 27.5800 50.8958 56.0287 64.8223 126.5718 149.7229 155.0457 207.3477 210.3159 214.8992 229.1966 230.0565 266.2100 268.5058 303.4288 319.2738 338.8701 362.2838 369.5852 383.1665 383.6424 399.9625 410.8703 412.0126 475.8419 487.1656 508.3277 508.4770 522.0045 539.8225 567.9980 695.9232 702.1263 705.9238 739.7526 744.8568 747.6740 757.3101 770.2979 786.6213 788.1020 817.7389 826.5161 838.0588 844.5958 863.7231 868.6439 886.4297 886.9434 926.9803 927.1998 943.3857 955.2984 963.3799 963.6359 966.4041 969.6480 976.1060 984.6495 990.2111 995.4086 1003.5168 1023.4557 1060.1133 1061.1796 1083.3645 1083.5679 1095.5560 1095.5622 1109.6845 1111.3642 1112.3467 1112.3665 1155.3252 1155.9495 1163.1738 1164.8248 1182.3672 1183.9208 1193.7556 1202.7182 1209.7045 1215.3774 1216.4777 1230.1401 1238.2129 1238.9821 1246.0563 1249.2450 1260.0145 1261.3013 1283.6953 1294.5306 1297.7718 1300.6789 1310.6030 1310.8567 1315.3200 1318.9540 1319.8050 1323.2495 1324.5298 1324.7437 1329.5763 1332.6886 1339.5489 1343.2857 1350.5253 1350.7999 1356.9351 1356.9382 1363.4341 1363.5066 1373.7393 1374.3193 1392.9205 1398.3629 1438.1047 1441.9979 1455.8808 1455.9102 1464.2710 1464.3141 1470.0359 1470.0973 1474.7108 1474.9587 1476.7873 1477.0166 1488.8787 1488.8841 2900.2555 2900.2650 2911.5278 2911.5492 2949.5875 2951.3823 2959.8848 2959.8989 2962.4364 2963.0811 2966.5118 2966.5167 2969.8213 2969.8300 2981.8414 2981.9041 2985.8772 2985.9252 2998.9916 2999.3063 3007.2163 3007.3719 3016.8790 3016.9254 3024.6119 3024.6299 3041.4057 3041.4358 3055.6707 3055.8139 3055.8915 3055.9735 3069.8919 3070.3052
redmass: 3.2640 3.9337 2.8895 3.2856 2.8902 2.6917 2.2514 4.4894 3.7237 3.1984 2.1507 2.0746 2.9816 2.7352 2.3133 2.2931 2.9232 2.4674 2.7094 2.4532 1.9901 2.7427 2.6473 4.5184 2.4680 2.9305 2.9695 4.9670 3.8013 3.4234 3.3639 2.6997 5.7854 5.6657 4.0038 3.2786 3.5045 4.5072 2.3436 1.6219 1.7952 2.1746 2.5362 2.3676 1.6699 2.0972 3.5662 3.4262 2.5408 2.4512 1.9723 1.9938 2.2560 2.2236 3.2818 2.4503 2.2755 2.2286 2.2584 3.1533 3.1908 3.0868 2.2406 2.3445 2.1917 2.2233 2.7510 2.7492 1.6123 1.5975 1.9437 1.9133 2.0360 1.8368 1.8444 1.7136 1.3286 1.3171 1.2750 1.4734 1.5668 1.8492 1.2391 1.2719 1.2068 1.1600 1.1395 1.1969 1.2075 1.1648 1.9290 2.0389 1.1477 1.1574 1.2110 1.2106 1.5372 1.6116 1.5909 1.4864 1.4672 1.5041 1.4074 1.4682 1.4879 1.4913 1.4767 1.3373 1.3782 1.3498 1.4398 1.4148 1.4320 1.4312 1.4087 1.4072 1.4370 1.4403 1.5777 1.5654 1.0896 1.0934 1.0770 1.0769 1.0779 1.0786 1.0896 1.0901 1.0788 1.0794 1.0937 1.0944 1.0876 1.0876 1.0680 1.0680 1.0710 1.0711 1.0752 1.0756 1.0705 1.0704 1.0737 1.0735 1.0759 1.0759 1.0604 1.0604 1.0737 1.0737 1.0646 1.0647 1.0736 1.0737 1.0912 1.0912 1.0989 1.0988 1.0998 1.0998 1.1023 1.1023 1.1012 1.0981 1.0929 1.0899 1.0989 1.0986
irintensity: 0.2151 0.0074 0.0000 0.3678 0.0000 0.0000 0.6857 0.0000 0.0000 5.8611 3.2468 0.0000 3.5959 0.0000 16.7469 0.0000 0.1631 2.0882 0.0000 0.0000 5.3878 0.0000 0.0001 7.9727 0.1369 0.0000 0.9308 0.0000 0.0000 1.5475 0.0001 14.6181 0.0000 14.0988 0.0000 0.0000 184.9739 20.4334 0.0000 33.0567 0.0000 16.3961 0.0000 13.6836 0.0000 50.0871 0.0000 4.0779 0.0000 6.7966 0.0001 1.6223 0.0006 2.5415 0.0000 27.8182 0.0000 0.2467 0.0000 291.4961 0.0000 33.4114 121.8938 0.0000 6.0430 0.0000 57.4308 0.0000 0.5776 0.0000 0.2401 2.9007 14.1888 0.0000 0.0216 2.6034 0.0001 27.9564 0.0000 55.5098 109.9748 0.0000 0.0000 25.1906 0.0000 27.2970 0.0001 24.0697 13.8466 0.0000 73.7249 0.0000 0.0000 3.1865 0.0000 18.1810 14.4175 0.0000 6.9979 0.0000 20.9760 0.0000 3.6517 0.0000 0.0000 5.3288 7.5292 0.0000 2.4882 0.0000 0.0003 9.6192 0.5346 2.1921 0.0008 4.2390 46.1321 0.0003 0.0000 65.7961 10.2303 0.0000 3.4912 0.0038 0.0078 4.5591 0.0008 35.6673 0.0033 18.0275 50.9141 0.0002 6.4164 1.5320 4.7988 99.0797 1.1079 112.2420 33.6875 0.0000 0.0012 3.5399 0.0003 162.9697 15.8568 0.0059 8.1995 0.0026 0.0121 262.3165 0.1160 214.7101 183.9277 0.0038 0.0473 96.0052 22.5190 0.0764 0.1177 21.2590 0.0066 136.0517 165.5274 0.0767 0.3299 94.3198 58.7092 0.0023
temp: 298.150 k
press: 1.00000 atm
elementType: 8 8 7 7 6 6 6 6 6 6 6 6 6 6 6 6 6 6 6 6 6 6 6 6 1 1 1 1 1 1 1 1 1 1 1 1 1 1 1 1 1 1 1 1 1 1 1 1 1 1 1 1 1 1 1 1 1 1
symmnumber: 1
zpe: 1358630.4 jmol-1
zpe.correction: 0.517475 hartree
zpe.thermalcorrener: 0.538900 hartree
zpe.thermalcorrenthalpy: 0.539844 hartree
zpe.thermalcorrgfe: 0.465061 hartree
zpe.sumelectzpe: -1040.509867 hartree
zpe.sumelectthermal: -1040.488443 hartree
zpe.sumelectthermalent: -1040.487499 hartree
zpe.sumelectthermalfe: -1040.562282 hartree
dipole: 0.0000 0.0000 0.0000
dipole: 0.0000
quadrupole: -136.4498 -144.7126 -148.4506
quadrupole: -0.2315 -1.1848 -5.0582
quadrupole: 6.7545 -1.5082 -5.2463 -0.2315 -1.1848 -5.0582
hfenergy: -1041.0273424 hartree
pointgroup: C01 [X(C20H34N2O2)]
dipole: 0.0000033 0.0000014 -0.0000047 debye
polarizability: 290.6005828|-1.5689271|191.9426905|3.7719408|-0.223964|199.006912 unknown
InChI: InChI=1S/C20H34N2O2/c1-2-16-4-3-15(1)9-21(10-16)19-13-24-20(14-23-19)22-11-17-5-6-18(12-22)8-7-17/h15-20H,1-14H2
charge 0 multiplicity 1
58 atoms
O  0.785565 0.926384 -0.787938
O  -0.767577 -0.997627 0.654161
N  2.830189 -0.245445 -0.20638
N  -2.812206 0.174208 0.072606
C  4.796414 0.393944 1.271431
C  5.102891 -0.48858 -1.330447
C  -4.778458 -0.465192 -1.405162
C  -5.084892 0.41744 1.196683
C  5.876451 1.186855 0.493849
C  5.101153 -1.124997 1.184933
C  5.878547 0.82589 -1.022594
C  5.439464 -1.575384 -0.275852
C  -5.083175 1.053756 -1.318725
C  -5.858484 -1.258071 -0.627533
C  -5.421401 1.50423 0.142055
C  -5.860644 -0.896982 0.888882
C  3.347857 0.726275 0.785745
C  3.571029 -0.277655 -1.49021
C  -3.32989 -0.797516 -0.919507
C  -3.553041 0.206419 1.356439
C  1.410489 -0.390603 -0.330485
C  -1.392502 0.319358 0.196707
C  -0.648112 0.765004 -1.077248
C  0.6661 -0.836244 0.943471
H  4.854395 0.702957 2.33549
H  5.450506 -0.844677 -2.322807
H  -4.836466 -0.774249 -2.469207
H  -5.432478 0.773593 2.189033
H  5.719647 2.274122 0.631909
H  6.86359 0.953416 0.939974
H  4.229689 -1.690669 1.560584
H  5.9543 -1.35416 1.853652
H  5.43697 1.64814 -1.618862
H  6.923022 0.716509 -1.374224
H  4.896357 -2.508576 -0.518042
H  6.520166 -1.807352 -0.357196
H  -5.936355 1.282892 -1.987411
H  -4.211726 1.619398 -1.694455
H  -5.701628 -2.345343 -0.765503
H  -6.84562 -1.024714 -1.073704
H  -4.878202 2.437382 0.384191
H  -6.50208 1.736297 0.223423
H  -6.905132 -0.787462 1.240433
H  -5.419192 -1.719225 1.485252
H  2.668331 0.712401 1.654219
H  3.324176 1.764507 0.38127
H  3.398459 0.651913 -2.082329
H  3.155997 -1.11972 -2.078431
H  -3.306199 -1.835747 -0.515029
H  -2.650388 -0.783642 -1.787998
H  -3.137958 1.048441 1.944684
H  -3.380521 -0.723177 1.948528
H  1.194393 -1.135134 -1.127614
H  -1.176404 1.063888 0.993837
H  -0.783656 0.026032 -1.894708
H  -1.00615 1.754626 -1.408904
H  1.024138 -1.825865 1.275132
H  0.801645 -0.097269 1.760928
