program: Gaussian 09
title: 000270181
version: EM64L-G09RevD.01
frameworkgroup: C1[X(C20H12ClNO2)]
method: RPBEPBE
basis: SDD
operation: Freq
keyword: #p
keyword: freq=noraman
keyword: PBEPBE/SDD
title: #p freq=noraman PBEPBE/SDD
converged: YES YES NO NO
title: Mulliken charges:
elementType: Cl O O N C C C C C C C C C C C C C C C C C C C C H H H H H H H H H H H H
charge: -0.053408 -0.443179 -0.253547 -0.046573 -0.276347 0.316513 0.257452 0.430729 0.174640 0.057132 -0.402840 -0.487602 -0.381307 -0.381949 0.367712 -0.434162 -0.238605 -0.238830 0.115543 -0.368191 -0.359323 -0.227375 -0.216863 -0.113543 0.300523 0.240731 0.272254 0.276148 0.245421 0.232388 0.231630 0.228149 0.274841 0.255744 0.255814 0.390281
chargesum: 0.00000
title: Mulliken charges with hydrogens summed into heavy atoms:
elementType: Cl O O N C C C C C C C C C C C C C C C C C C C C
charge: -0.053408 -0.052898 -0.253547 -0.046573 -0.276347 0.316513 0.257452 0.430729 0.174640 0.057132 -0.102317 -0.246871 -0.109053 -0.105801 0.367712 -0.188741 -0.006217 -0.007200 0.115543 -0.140043 -0.084483 0.028370 0.038952 -0.113543
polarizability: 4.38703462e+02 2.54944483e+01 3.17248600e+02 1.56415946e+00 3.41586417e+00 8.83546415e+01
1716.lowfreq: -7.8072 -2.6943 -0.0018 -0.0012 0.0014 2.9679 10.8018 33.1120 41.6323
frequency: 7.7403 33.1107 41.6287 55.8835 62.1527 94.9232 143.1465 150.2626 173.7936 197.2909 228.5107 241.0449 258.1410 276.6532 318.2077 336.4778 355.5511 407.4403 421.5397 424.6345 440.0058 448.4635 469.7917 490.0329 515.5149 535.1323 572.5180 575.6199 610.5325 611.1350 619.8289 627.3783 651.9931 672.6395 714.0012 715.7444 740.4186 745.9069 748.5526 773.9894 824.3197 829.1955 840.7225 848.4149 862.9455 863.8535 871.9182 904.9750 931.7113 956.1835 976.0685 987.6952 996.4707 1004.8185 1005.5397 1010.6695 1028.8098 1047.5173 1074.4215 1094.1442 1112.0194 1124.9621 1157.7839 1171.1375 1184.4434 1209.3578 1236.0631 1246.2728 1264.3980 1290.0307 1296.5686 1327.9363 1329.0407 1358.1164 1372.4715 1387.5671 1400.5626 1413.4692 1421.7854 1445.1441 1479.7785 1489.7119 1518.3964 1541.4238 1573.4981 1580.1869 1599.0769 1607.7430 1624.9823 1636.4351 3125.6047 3131.4049 3139.2484 3148.9820 3158.4415 3159.7022 3173.6324 3176.0842 3179.3480 3189.3022 3200.7606 3530.6804
redmass: 3.7343 8.3974 8.2408 6.7445 8.2599 5.8764 5.5200 7.5415 5.4118 7.8554 9.6406 5.0467 5.2478 7.0869 6.4621 5.3495 7.6219 2.8868 4.3459 4.7760 6.8282 3.9216 6.0078 3.2276 7.0192 2.9428 5.8466 3.2707 1.4296 6.4840 6.2798 7.0226 3.7348 6.3812 5.4855 4.3684 3.4676 6.5783 2.8915 1.4627 1.4356 2.3044 6.8172 1.5454 1.8015 6.4007 4.9733 1.7124 1.6122 1.3684 1.3765 1.3957 4.2526 1.3646 4.8490 1.3466 2.1710 3.7430 2.6249 2.2538 1.4549 1.8990 1.3888 1.1067 1.1708 1.8852 1.8150 1.8871 2.0557 1.7420 1.3403 5.2066 4.9788 3.7762 5.2064 4.0212 3.6870 5.0880 2.4429 3.3091 2.6901 3.8751 4.1774 6.8063 7.2248 7.5451 6.2688 6.2065 6.7864 8.4030 1.0866 1.0903 1.0905 1.0884 1.0963 1.0886 1.0960 1.0967 1.0969 1.0943 1.0911 1.0642
irintensity: 0.0061 0.6323 0.8206 0.0323 0.0395 0.9991 0.1523 1.2358 4.3920 0.3283 0.3417 0.0239 2.0893 6.8074 0.7507 0.1504 0.0745 0.1055 8.0849 12.7101 12.0714 2.3550 4.8961 31.4963 1.2739 28.8363 21.2136 14.4766 96.3674 45.0790 15.3499 2.9078 0.1335 6.9229 12.8333 12.3404 34.5313 2.4735 21.3659 36.8047 11.6235 0.8999 7.0884 45.7428 63.2440 13.2915 17.4924 9.0217 12.9580 0.4847 4.8770 4.2348 60.4672 3.2387 156.8327 0.2425 87.4379 28.2060 50.7884 118.4967 8.7489 87.3186 2.9564 7.8923 15.7094 7.9648 3.7356 25.6725 9.3532 35.9549 11.2381 40.4581 14.6562 75.4561 64.7035 16.8751 9.8536 14.0543 4.6783 10.9101 92.5925 31.8831 15.5169 50.4363 93.4518 3.7959 10.7284 32.9674 8.3907 194.4418 0.5519 11.1876 17.0223 7.7060 33.0714 0.8074 5.5181 18.0369 4.5650 13.7870 0.9788 63.6768
temp: 298.150 k
press: 1.00000 atm
elementType: 17 8 8 7 6 6 6 6 6 6 6 6 6 6 6 6 6 6 6 6 6 6 6 6 1 1 1 1 1 1 1 1 1 1 1 1
symmnumber: 1
zpe: 688937.1 jmol-1
zpe.correction: 0.262402 hartree
zpe.thermalcorrener: 0.281141 hartree
zpe.thermalcorrenthalpy: 0.282085 hartree
zpe.thermalcorrgfe: 0.212394 hartree
zpe.sumelectzpe: -1433.019225 hartree
zpe.sumelectthermal: -1433.000486 hartree
zpe.sumelectthermalent: -1432.999542 hartree
zpe.sumelectthermalfe: -1433.069233 hartree
dipole: -1.5729 0.5662 0.0224
dipole: 1.6719
quadrupole: -146.1028 -121.9752 -150.6778
quadrupole: 14.0906 0.4084 1.3330
quadrupole: -6.5175 17.6100 -11.0925 14.0906 0.4084 1.3330
hfenergy: -1433.2816269 hartree
pointgroup: C01 [X(C20H12Cl1N1O2)]
dipole: -0.5997994 -0.2677825 -0.0344707 debye
polarizability: 441.7962274|-14.8173471|309.6390542|-8.5404519|31.3988043|92.8714217 unknown
InChI: InChI=1S/C20H12ClNO2/c21-14-8-5-13(6-9-14)18-11-17(20(23)24)16-10-7-12-3-1-2-4-15(12)19(16)22-18/h1-11,23H
charge 0 multiplicity 1
36 atoms
Cl 6.853923 1.655646 0.155407
O  0.259751 -4.391946 -0.51318
O  -2.037336 -4.177629 -0.420052
N  0.094745 0.564718 0.070292
C  -1.226427 0.196489 0.049674
C  -1.658357 -1.179443 -0.10089
C  -2.221847 1.260703 0.186765
C  -3.619335 0.920572 0.180393
C  -0.613384 -2.166436 -0.233309
C  1.066648 -0.379696 -0.058007
C  -3.072206 -1.474686 -0.104687
C  -4.006494 -0.461965 0.032907
C  0.731147 -1.757422 -0.210146
C  -1.840072 2.6272 0.324319
C  2.48054 0.091075 -0.019622
C  -4.593464 1.957247 0.316824
C  -2.811833 3.629186 0.45576
C  -4.197979 3.293789 0.45346
C  -0.911768 -3.622393 -0.389968
C  3.573544 -0.762901 -0.332648
C  2.759714 1.438369 0.340281
C  4.902976 -0.294031 -0.283702
C  4.080979 1.922273 0.396779
C  5.13841 1.044432 0.084193
H  -3.387974 -2.513199 -0.216333
H  -5.075646 -0.70595 0.02925
H  1.505575 -2.51971 -0.29631
H  -0.773289 2.865568 0.320688
H  -5.656795 1.690496 0.311689
H  -2.507429 4.676242 0.560124
H  -4.950069 4.083488 0.557164
H  3.406335 -1.802016 -0.632364
H  1.917044 2.094179 0.575052
H  5.738098 -0.955742 -0.529999
H  4.286785 2.958672 0.679447
H  -0.002812 -5.346179 -0.612651
