program: Gaussian 09
title: 000270180
version: EM64L-G09RevD.01
frameworkgroup: C1[X(C21H15NO2)]
method: RPBEPBE
basis: SDD
operation: Freq
keyword: #p
keyword: freq=noraman
keyword: PBEPBE/SDD
title: #p freq=noraman PBEPBE/SDD
converged: YES YES NO NO
title: Mulliken charges:
elementType: O O N C C C C C C C C C C C C C C C C C C C C C H H H H H H H H H H H H H H H
charge: -0.290277 -0.257877 -0.045140 -0.281502 0.313868 0.254014 0.430761 0.165953 -0.402333 0.059966 -0.490381 -0.388709 -0.383487 -0.436719 0.339355 -0.240614 -0.240173 0.168803 -0.377292 -0.368333 -0.248418 -0.230144 -0.239827 -0.498466 0.300562 0.238663 0.269895 0.277982 0.243872 0.230640 0.229613 0.220961 0.268786 0.226127 0.227123 0.230004 0.244363 0.244875 0.233507
chargesum: 0.00000
title: Mulliken charges with hydrogens summed into heavy atoms:
elementType: O O N C C C C C C C C C C C C C C C C C C C C C
charge: -0.290277 -0.257877 -0.045140 -0.281502 0.313868 0.254014 0.430761 0.165953 -0.101771 0.059966 -0.251718 -0.118814 -0.105506 -0.192847 0.339355 -0.009974 -0.010560 0.168803 -0.156331 -0.099548 -0.022291 -0.003021 -0.009823 0.224279
polarizability: 4.13412283e+02 -6.06320637e+00 3.20781569e+02 2.80100499e+00 -3.21605289e+00 9.53732420e+01
1716.lowfreq: -5.6411 -4.2449 -0.0008 -0.0007 -0.0003 3.1329 17.6696 21.8259 46.1656
frequency: 17.5039 21.7908 46.1511 58.0666 78.5031 97.1478 112.6044 121.6355 131.8370 188.0579 202.6093 223.2014 246.3352 259.3261 267.7663 300.6219 312.5808 360.0771 401.2290 417.1424 427.8260 456.3721 462.0360 480.2173 511.1740 551.2694 570.8892 578.0377 596.2324 615.8184 640.8524 654.3927 695.7263 697.8857 717.7039 726.2800 742.3685 745.4263 772.3148 787.2291 820.3724 827.2698 851.8807 861.0889 862.5745 871.7771 903.4544 928.7449 935.4888 945.1776 974.3838 984.5634 989.4121 1002.9689 1005.1136 1009.5154 1021.3076 1024.4405 1044.8433 1057.7810 1084.7859 1108.0483 1114.4474 1146.2959 1152.0173 1165.9261 1171.3643 1178.9409 1190.2022 1222.5108 1236.9371 1248.0168 1267.3467 1307.1395 1326.6423 1331.6841 1361.4361 1378.4754 1389.3924 1413.1234 1415.0938 1423.9058 1440.4929 1444.7616 1450.9156 1463.4378 1483.6425 1490.5263 1516.3059 1541.6725 1571.6702 1587.8216 1605.6809 1612.6198 1618.3293 1625.6447 3005.3719 3107.2526 3123.5736 3125.7950 3129.4569 3134.9621 3137.5799 3148.1888 3149.7728 3156.7868 3161.0354 3172.1669 3174.9239 3188.4992 3201.7950
redmass: 3.6650 5.2356 4.6279 5.1082 5.1052 1.1677 4.1870 4.4895 3.9156 4.6216 4.5183 4.7788 4.8995 6.4969 6.9141 4.7445 4.7524 7.5789 2.7993 3.5270 5.1306 5.5564 5.0077 3.4889 6.9942 4.5896 7.2649 3.6633 6.7078 6.4539 7.0848 3.4414 1.8252 5.2413 6.0707 4.8896 6.3964 2.6291 1.4460 2.0481 7.3137 2.5268 1.2747 1.7829 6.1393 5.1239 1.7253 1.5214 1.5257 8.5211 1.3780 1.4037 5.6021 1.3442 1.3417 1.3454 3.3145 2.4369 3.0928 2.7595 1.6846 2.3079 1.2626 1.4815 1.5175 1.3394 1.0786 1.7964 1.1683 2.0547 1.7982 1.6231 2.0489 1.8365 6.0834 2.5596 3.6586 3.8568 5.5424 7.3261 2.0647 1.2030 2.6051 3.0718 1.0496 1.0525 2.5588 3.7559 4.0668 6.8760 7.4167 6.1544 6.4474 6.1954 8.8784 6.8198 1.0295 1.1045 1.0865 1.0847 1.0902 1.0883 1.0905 1.0935 1.1048 1.0964 1.0969 1.0981 1.0966 1.0942 1.0907
irintensity: 0.0007 1.4263 0.4259 0.9808 0.2133 0.2369 0.0218 1.0933 0.1196 11.0428 4.4656 0.5337 0.0472 5.4686 0.3453 6.1079 4.8683 10.7265 0.0576 1.6454 5.1348 3.2419 3.4409 9.5458 0.7538 0.0317 2.2455 4.0674 13.8028 0.2134 11.5762 0.3951 43.1394 3.7393 2.6450 53.1164 1.4170 6.6538 43.0382 29.2697 14.1335 4.9495 2.5058 56.7134 1.4137 13.0983 8.0209 17.6893 0.5884 12.4485 4.9742 0.7097 0.2394 0.2920 1.2836 0.3311 12.0234 6.2710 90.4209 61.0128 5.6847 59.8778 0.0624 101.4354 51.9165 25.2997 10.1030 104.3695 23.9856 111.2983 3.6621 43.7931 23.9531 9.9407 2.0600 49.2669 59.4957 27.2287 3.8342 14.4490 3.9435 35.3689 0.3538 11.1471 14.3767 12.5614 18.4374 34.2338 27.0117 41.6443 92.3847 3.2825 25.7371 8.4726 86.2812 1.3163 43.7213 24.3904 0.4560 2.3815 11.7432 6.2060 18.5660 31.6854 14.2956 36.8388 26.5396 18.7445 20.4680 15.9440 0.9348
temp: 298.150 k
press: 1.00000 atm
elementType: 8 8 7 6 6 6 6 6 6 6 6 6 6 6 6 6 6 6 6 6 6 6 6 6 1 1 1 1 1 1 1 1 1 1 1 1 1 1 1
symmnumber: 1
zpe: 786071.0 jmol-1
zpe.correction: 0.299399 hartree
zpe.thermalcorrener: 0.318650 hartree
zpe.thermalcorrenthalpy: 0.319594 hartree
zpe.thermalcorrgfe: 0.249531 hartree
zpe.sumelectzpe: -1012.840941 hartree
zpe.sumelectthermal: -1012.821690 hartree
zpe.sumelectthermalent: -1012.820745 hartree
zpe.sumelectthermalfe: -1012.890808 hartree
dipole: -1.3709 0.6135 -0.0144
dipole: 1.5020
quadrupole: -112.7681 -119.2370 -145.1971
quadrupole: -10.0390 0.6931 -1.1736
quadrupole: 12.9659 6.4971 -19.4630 -10.0390 0.6931 -1.1736
hfenergy: -1013.1403395 hartree
pointgroup: C01[X(C21H15N1O2)]
dipole: -0.4654677 0.3630565 -0.0270411 debye
polarizability: 405.2288017|-26.9775143|327.41356|1.5679919|-19.3852238|96.9247325 unknown
InChI: InChI=1S/C21H15NO2/c1-24-21(23)18-13-19(15-8-3-2-4-9-15)22-20-16-10-6-5-7-14(16)11-12-17(18)20/h2-13H,1H3
charge 0 multiplicity 1
39 atoms
O  -0.769879 4.041622 -0.172518
O  1.546388 3.97962 -0.14047
N  -0.263126 -0.912498 0.139789
C  1.029117 -0.453141 0.103067
C  1.364571 0.954469 0.018369
C  2.095922 -1.454259 0.150822
C  3.467658 -1.023173 0.12313
C  0.253801 1.876026 -0.02949
C  2.75653 1.341895 -0.008866
C  -1.298569 -0.030698 0.092757
C  3.759088 0.388369 0.043866
C  -1.05816 1.373167 0.009593
C  1.806992 -2.848596 0.221368
C  4.509913 -2.000033 0.171676
C  -2.678485 -0.596613 0.141847
C  2.844211 -3.790556 0.267062
C  4.205315 -3.365218 0.243229
C  0.453585 3.359729 -0.115598
C  -3.831948 0.197376 -0.107247
C  -2.858895 -1.974609 0.44453
C  -5.123321 -0.368557 -0.050437
C  -4.148432 -2.538909 0.503708
C  -5.289453 -1.738542 0.257437
C  -0.669278 5.51647 -0.261457
H  2.998518 2.404109 -0.069924
H  4.809359 0.703574 0.023668
H  -1.884987 2.082822 -0.010643
H  0.7576 -3.154578 0.234792
H  5.5534 -1.664106 0.150931
H  2.610886 -4.859567 0.320272
H  5.009589 -4.108242 0.279547
H  -3.734702 1.257901 -0.361999
H  -1.967405 -2.580341 0.630297
H  -5.999446 0.258398 -0.250172
H  -4.266681 -3.601696 0.742981
H  -6.292931 -2.176177 0.302884
H  -0.127115 5.807478 -1.176795
H  -0.135705 5.917371 0.616546
H  -1.710722 5.866114 -0.288055
