program: Gaussian 09
title: 000277377
version: EM64L-G09RevD.01
frameworkgroup: C1[X(C19H13FO)]
method: RPBEPBE
basis: SDD
operation: Freq
keyword: #p
keyword: freq=noraman
keyword: PBEPBE/SDD
title: #p freq=noraman PBEPBE/SDD
converged: YES YES NO NO
title: Mulliken charges:
elementType: F O C C C C C C C C C C C C C C C C C C C H H H H H H H H H H H H H
charge: -0.209652 -0.454444 -0.182477 0.236000 0.236231 0.149302 0.148874 0.424215 -0.404244 -0.404165 -0.398160 -0.398010 -0.343669 -0.388287 -0.230251 -0.230131 -0.232612 -0.232651 -0.366407 -0.360633 0.309865 0.262934 0.262896 0.242201 0.242209 0.354560 0.246918 0.294645 0.230459 0.230436 0.228642 0.228647 0.253652 0.253106
chargesum: 0.00000
title: Mulliken charges with hydrogens summed into heavy atoms:
elementType: F O C C C C C C C C C C C C C C C C C C C
charge: -0.209652 -0.099884 -0.182477 0.236000 0.236231 0.149302 0.148874 0.424215 -0.141310 -0.141269 -0.155959 -0.155801 -0.096751 -0.093642 0.000207 0.000305 -0.003970 -0.004004 -0.112755 -0.107526 0.309865
polarizability: 2.33807797e+02 -1.25602198e-01 2.32828488e+02 -3.05486813e+01 5.20050111e-02 1.47590071e+02
1716.lowfreq: -12.7876 -8.4590 -8.2946 -0.0008 -0.0006 -0.0003 3.9069 43.1739 44.6601
frequency: -12.2309 43.1645 44.6551 90.6575 122.4673 157.1581 179.3033 199.6973 208.0989 270.6953 300.3699 320.8184 334.0704 351.5887 379.6813 408.9304 410.1121 414.7667 434.5382 474.2822 506.7010 521.7727 566.5762 567.9960 581.3680 615.2858 626.9727 634.4480 682.5445 722.1803 733.1625 747.9512 758.9495 767.6128 789.5470 791.5382 819.1917 832.1366 876.9995 883.0798 898.1775 901.6686 952.3994 953.7621 954.3775 975.2971 985.0040 988.5234 990.5155 995.3399 1006.7923 1019.1896 1030.8979 1092.0662 1102.4951 1107.5349 1151.0281 1154.5722 1166.4782 1168.4417 1179.9358 1182.6596 1199.2155 1234.0095 1283.9858 1286.8143 1297.1801 1313.3830 1370.8932 1380.9536 1399.9968 1404.8346 1436.4800 1443.0893 1462.2276 1482.5457 1491.6740 1593.1469 1594.9392 1602.2183 1610.9944 1615.1574 1615.2774 3126.0594 3127.1798 3136.1779 3137.5280 3140.4333 3148.1315 3149.0048 3164.3014 3164.9759 3165.1653 3174.6405 3189.1547 3564.0653
redmass: 3.9495 6.8166 5.0283 4.7010 4.9008 5.0128 4.9612 6.1543 4.2426 6.4601 2.5995 1.6380 6.2645 4.0225 5.3330 2.9799 4.7017 4.4183 4.3272 3.2734 5.2409 2.9621 3.3859 6.7566 4.9155 6.9520 7.2345 5.6066 5.8934 3.8868 4.3248 2.9529 1.6966 1.6884 2.3349 5.8650 1.3141 1.5985 1.4603 1.4878 3.1360 4.0672 1.4386 1.4521 1.4245 1.3645 6.5911 1.3341 1.3617 6.2823 2.7614 2.2304 1.9720 2.0279 1.8160 1.3674 2.0155 1.5109 1.3173 1.2441 1.8726 1.7596 2.2649 1.9628 1.5004 1.4018 1.7567 1.9310 9.4990 6.4564 3.4908 3.3844 2.2100 2.8281 2.5635 4.0746 2.6552 7.2599 6.5313 8.0018 6.4519 7.4074 7.0401 1.0857 1.0855 1.0894 1.0897 1.0895 1.0948 1.0950 1.1003 1.0999 1.0902 1.0957 1.0955 1.0660
irintensity: 0.0158 0.0568 0.0947 1.6735 0.0027 0.0676 0.1160 0.1857 1.5102 1.3871 16.2321 92.9691 7.9301 10.9736 1.7837 0.8794 0.9146 2.4101 6.0518 6.5739 0.7198 6.8546 0.1752 44.9026 4.3280 1.9389 0.0793 13.4599 0.5996 0.2769 17.0584 46.3615 0.9449 108.0955 0.3623 24.3862 13.2935 74.6369 6.5853 0.0004 37.6551 0.8884 0.7664 2.4807 0.2633 0.1208 46.6960 0.0814 1.8830 2.8373 13.3011 2.1037 4.1834 1.8841 2.4909 7.0478 51.4040 59.2853 2.2348 1.1838 0.0145 0.5845 35.2939 1.5572 6.2781 1.3806 7.9291 40.6742 5.2795 12.0034 6.6628 0.2228 35.0500 9.7971 5.1808 1.3279 124.3129 0.5031 2.1185 7.3373 12.2417 7.1123 2.1973 3.1742 0.3883 7.7430 1.1691 7.5859 0.1519 43.1582 57.6518 9.9077 1.4220 3.3459 2.5587 13.7645
temp: 298.150 k
press: 1.00000 atm
elementType: 9 8 6 6 6 6 6 6 6 6 6 6 6 6 6 6 6 6 6 6 6 1 1 1 1 1 1 1 1 1 1 1 1 1
symmnumber: 1
zpe: 679682.6 jmol-1
zpe.correction: 0.258877 hartree
zpe.thermalcorrener: 0.274240 hartree
zpe.thermalcorrenthalpy: 0.275184 hartree
zpe.thermalcorrgfe: 0.216385 hartree
zpe.sumelectzpe: -905.476005 hartree
zpe.sumelectthermal: -905.460643 hartree
zpe.sumelectthermalent: -905.459699 hartree
zpe.sumelectthermalfe: -905.518498 hartree
dipole: 3.7943 0.0036 0.0109
dipole: 3.7944
quadrupole: -124.2179 -109.0772 -117.1272
quadrupole: -0.0296 -8.3914 0.0339
quadrupole: -7.4105 7.7302 -0.3198 -0.0296 -8.3914 0.0339
hfenergy: -905.7348828 hartree
pointgroup: C01 [X(C19H13F1O1)]
dipole: -1.4928114 -0.001358 -0.0013847 debye
polarizability: 233.6895897|-0.7157674|232.7588976|-30.7059338|-2.4433623|147.7778685 unknown
InChI: InChI=1S/C19H13FO/c20-14-11-9-13(10-12-14)19(21)17-7-3-1-5-15(17)16-6-2-4-8-18(16)19/h1-12,21H
charge 0 multiplicity 1
34 atoms
F  5.323106 0.01695 1.135487
O  0.060149 -0.086081 -2.395312
C  -0.04554 -0.046695 -0.917341
C  -0.879132 -1.226948 -0.37827
C  -0.880323 1.159967 -0.442366
C  -2.032369 -0.755893 0.312316
C  -2.033221 0.72557 0.272402
C  1.395016 -0.031426 -0.386188
C  -0.625078 -2.600147 -0.513178
C  -0.62769 2.524159 -0.651031
C  -2.94442 -1.669268 0.881191
C  -2.946529 1.667218 0.790953
C  1.622832 0.001478 1.013481
C  2.500589 -0.048221 -1.268754
C  -1.54437 -3.519809 0.053928
C  -1.548134 3.471985 -0.134479
C  -2.690844 -3.05619 0.746203
C  -2.694372 3.045147 0.581493
C  2.933543 0.017899 1.532344
C  3.822752 -0.032297 -0.766866
C  4.006848 0.000627 0.623721
H  0.265883 -2.952244 -1.043786
H  0.262826 2.848281 -1.199898
H  -3.833696 -1.321056 1.418311
H  -3.835581 1.347295 1.345742
H  -0.859389 -0.09606 -2.764538
H  0.772377 0.014179 1.704243
H  2.316624 -0.073614 -2.34506
H  -1.366456 -4.596728 -0.040171
H  -1.37136 4.542477 -0.286368
H  -3.388426 -3.780394 1.181735
H  -3.392826 3.791012 0.977253
H  3.127124 0.043251 2.608578
H  4.689387 -0.044923 -1.434377
