program: Gaussian 09
title: 000277405
version: EM64L-G09RevD.01
frameworkgroup: C1[X(C14H29O3P)]
method: RPBEPBE
basis: SDD
operation: Freq
keyword: #p
keyword: freq=noraman
keyword: PBEPBE/SDD
title: #p freq=noraman PBEPBE/SDD
converged: NO YES NO NO
title: Mulliken charges:
elementType: P O O O C C C C C C C C C C C C C C H H H H H H H H H H H H H H H H H H H H H H H H H H H H H
charge: 1.261896 -0.505485 -0.530168 -0.624186 -0.615419 0.032418 0.002806 -0.443893 -0.482590 -0.448763 -0.044651 -0.746613 -0.741255 -0.739219 -0.230009 -0.240549 -0.655277 -0.659083 0.286345 0.188862 0.221724 0.235431 0.235743 0.212483 0.207414 0.203514 0.199093 0.200566 0.221957 0.208293 0.262243 0.231351 0.211049 0.206072 0.226250 0.211688 0.205993 0.217481 0.212518 0.223678 0.217477 0.205147 0.232870 0.238093 0.208696 0.218016 0.259996
chargesum: 0.00000
title: Mulliken charges with hydrogens summed into heavy atoms:
elementType: P O O O C C C C C C C C C C C C C C
charge: 1.261896 -0.505485 -0.530168 -0.624186 -0.329074 0.221280 0.224529 0.027281 -0.062693 -0.046155 0.155915 -0.054120 -0.092783 -0.095289 0.199989 0.200605 0.020832 0.027625
polarizability: 2.11232882e+02 -2.45598732e-01 1.89006481e+02 -3.25392304e+00 2.57297406e+00 1.53011483e+02
1716.lowfreq: -29.9208 -15.0842 -10.1332 -0.0010 -0.0008 0.0003 3.1008 13.8149 15.9297
frequency: -29.6446 -11.0621 15.0630 28.5587 37.9049 60.5144 73.1810 81.1353 83.9946 146.1996 149.5722 154.8478 184.1962 187.0846 192.6151 206.0822 216.7503 232.2974 233.2728 245.8204 255.6483 281.4541 303.0703 329.7180 359.9694 367.8033 382.9244 388.9327 415.1900 421.7905 444.0630 459.4416 480.5314 508.2508 598.0582 606.7365 640.2967 733.0928 778.6849 795.9011 797.6566 801.6850 853.5372 854.8002 864.0593 874.2694 907.0684 912.7072 935.7675 947.1509 956.1009 980.0125 999.4734 1009.6298 1014.3207 1016.8935 1039.9886 1070.5869 1089.8233 1091.0906 1095.1169 1095.7369 1112.6758 1134.9845 1139.3303 1147.0909 1157.0123 1169.1259 1177.0231 1218.5156 1232.0478 1242.7138 1268.9275 1270.3674 1271.5881 1290.3896 1297.6359 1308.4729 1319.0568 1327.4571 1329.6622 1338.7663 1347.5918 1351.6002 1353.5368 1361.7376 1378.7411 1385.1523 1387.1571 1396.1543 1399.7963 1456.8081 1458.8396 1458.9749 1460.2793 1460.4906 1466.2341 1468.3944 1472.1672 1477.6828 1480.6148 1480.8335 1485.5413 1486.2705 1487.5580 1495.9897 2923.3578 2951.4327 2959.8493 2969.2140 2972.2562 2973.1520 2982.8327 2984.6718 2985.1629 2985.5213 2990.7759 2993.8445 2997.0167 2997.5306 3026.2288 3040.7741 3056.0160 3056.3901 3058.1630 3065.8732 3068.0026 3076.3709 3076.5470 3081.0134 3081.2877 3083.0229 3085.5876 3106.0350 3107.4024
redmass: 3.3741 2.5502 3.7736 2.7614 2.4868 2.6263 2.7492 3.8206 3.4680 3.1063 2.4276 3.4793 1.4266 1.5788 2.7429 1.9475 1.9327 1.4461 1.4733 1.5772 1.5290 2.2806 5.3572 2.8917 2.1417 2.8588 2.0013 3.3219 3.8042 3.4370 2.6053 3.9617 2.7113 2.6727 3.5321 3.4684 6.6945 3.3635 2.6344 1.1410 2.0262 1.1300 1.8454 2.5094 3.4438 3.3274 2.1403 1.2106 1.8010 1.7191 1.4180 1.6506 1.7498 2.7136 2.8534 1.9664 7.3824 2.0001 1.9507 1.8706 1.8191 2.1176 1.6249 1.5959 1.9405 1.6251 2.0030 1.8034 2.0510 1.4333 1.4591 1.2754 1.1226 1.1786 1.2066 1.2150 1.3226 1.5021 1.4244 1.3652 1.3712 1.5230 1.2249 1.3766 1.2255 1.4733 1.2139 1.2365 1.2294 1.2062 1.2087 1.0430 1.0746 1.0741 1.0746 1.0434 1.0732 1.0540 1.0819 1.0447 1.0542 1.0542 1.0606 1.0553 1.0566 1.0477 1.0805 1.0843 1.0635 1.0369 1.0615 1.0388 1.0781 1.0418 1.0359 1.0409 1.0540 1.0636 1.0607 1.0797 1.0974 1.0996 1.1034 1.1030 1.0987 1.0979 1.1039 1.0988 1.0992 1.0979 1.0980 1.0973 1.0991 1.1023 1.1030
irintensity: 1.5709 0.6436 0.5663 1.1698 0.0265 0.5685 0.0767 1.0227 1.4075 2.8594 4.0565 1.6709 2.5641 3.3362 9.1770 1.6422 0.7109 1.1356 2.3240 0.7766 3.2024 0.8418 11.3456 0.6029 1.0737 0.0332 1.0927 8.2012 22.2368 6.0222 2.0424 20.3795 3.8907 1.7354 83.2012 32.3958 139.3892 6.6293 8.0858 2.9887 7.1120 3.9568 0.9955 7.0594 119.9742 134.8932 1.3111 2.3644 2.1832 7.8733 0.4158 0.1000 13.6604 141.4784 131.4188 34.7973 61.1479 1.0691 1.9097 3.8215 4.5148 11.2234 3.9984 13.1320 7.4427 10.9756 2.8539 9.4684 7.9732 3.9385 2.6421 5.1796 0.2735 0.4533 0.3310 7.6568 6.0016 1.8375 1.9647 4.9482 1.6413 0.3716 10.5392 2.0111 10.7586 4.4324 20.9803 24.4966 29.8631 21.5198 18.3342 8.4368 4.7574 3.7607 15.1547 14.2676 4.9627 0.2901 6.4696 2.2540 13.0427 4.7238 6.9728 7.4263 22.2162 19.4623 6.4314 24.3584 31.0760 25.0180 29.9009 38.7162 15.3857 28.6109 23.2268 22.2044 22.6502 2.6753 43.0281 46.3401 51.0850 51.2590 5.9211 39.0301 0.7094 94.4997 9.8193 25.3711 51.0109 39.2824 39.2166 41.1931 32.7398 35.6759 27.9744
temp: 298.150 k
press: 1.00000 atm
elementType: 15 8 8 8 6 6 6 6 6 6 6 6 6 6 6 6 6 6 1 1 1 1 1 1 1 1 1 1 1 1 1 1 1 1 1 1 1 1 1 1 1 1 1 1 1 1 1
symmnumber: 1
zpe: 1078041.4 jmol-1
zpe.correction: 0.410604 hartree
zpe.thermalcorrener: 0.432292 hartree
zpe.thermalcorrenthalpy: 0.433236 hartree
zpe.thermalcorrgfe: 0.359045 hartree
zpe.sumelectzpe: -1116.290413 hartree
zpe.sumelectthermal: -1116.268726 hartree
zpe.sumelectthermalent: -1116.267782 hartree
zpe.sumelectthermalfe: -1116.341972 hartree
dipole: -0.9264 -0.1925 -3.9532
dipole: 4.0649
quadrupole: -113.4999 -114.2257 -128.2608
quadrupole: 2.9471 -10.2435 1.7442
quadrupole: 5.1622 4.4365 -9.5987 2.9471 -10.2435 1.7442
hfenergy: -1116.7010177 hartree
pointgroup: C01 [X(C14H29O3P1)]
dipole: 0.383195 0.042541 -1.5520667 debye
polarizability: 210.7656217|-3.0379885|189.4748078|3.3233514|-2.6688493|153.0104154 unknown
InChI: InChI=1S/C14H29O3P/c1-6-16-18(15,17-7-2)14-10-13(11(3)4)9-8-12(14)5/h11-14H,6-10H2,1-5H3
charge 0 multiplicity 1
47 atoms
P  -1.616495 0.190921 0.430015
O  -2.628804 1.585811 0.128997
O  -2.128115 -1.003068 -0.747242
O  -1.746179 -0.274166 1.947262
C  0.0859 0.61208 -0.258769
C  2.495964 -0.2355 -0.489594
C  0.54084 2.046958 0.127564
C  1.097518 -0.488871 0.141436
C  2.970742 1.207259 -0.165063
C  1.922711 2.280368 -0.543476
C  3.533021 -1.31339 -0.033911
C  0.57285 2.304613 1.65332
C  3.047156 -2.757535 -0.31864
C  4.918033 -1.098081 -0.694897
C  -3.197055 1.860035 -1.219779
C  -3.108814 -2.042387 -0.31534
C  -4.693661 1.539186 -1.229092
C  -2.392675 -3.246026 0.303053
H  -0.063696 0.574019 -1.357629
H  2.390429 -0.322631 -1.595934
H  -0.180524 2.764976 -0.312187
H  0.707198 -1.467877 -0.190106
H  1.188404 -0.534543 1.244662
H  3.910676 1.426405 -0.704238
H  3.205154 1.274599 0.917298
H  2.296303 3.284824 -0.263322
H  1.793094 2.283108 -1.646138
H  3.658103 -1.205744 1.066286
H  1.233053 1.598554 2.186228
H  0.941404 3.328082 1.851188
H  -0.433709 2.214411 2.09897
H  2.144721 -3.02057 0.260299
H  3.833766 -3.488244 -0.053862
H  2.814942 -2.889453 -1.393847
H  5.373759 -0.1335 -0.411633
H  5.619182 -1.897873 -0.392559
H  4.833223 -1.125909 -1.799062
H  -3.02015 2.937298 -1.389426
H  -2.664065 1.275992 -1.995056
H  -3.830525 -1.603692 0.400685
H  -3.636779 -2.309832 -1.246957
H  -5.147358 1.854519 -2.188231
H  -4.865571 0.456512 -1.101686
H  -5.203041 2.073332 -0.408991
H  -3.124608 -4.042374 0.537449
H  -1.646737 -3.658385 -0.399073
H  -1.887587 -2.949212 1.237927
