program: Gaussian 09
title: 000270173
version: EM64L-G09RevD.01
frameworkgroup: C1[X(C17H10Cl3NO)]
method: RPBEPBE
basis: SDD
operation: Freq
keyword: #p
keyword: freq=noraman
keyword: PBEPBE/SDD
title: #p freq=noraman PBEPBE/SDD
converged: YES YES NO NO
title: Mulliken charges:
elementType: Cl Cl Cl O N C C C C C C C C C C C C C C C C C H H H H H H H H H H
charge: 0.000722 -0.033212 -0.046556 -0.204162 -0.009244 0.337578 0.236026 -0.018644 0.052790 -0.384826 0.366964 -0.305237 -0.244040 0.100831 -0.175424 -0.254167 -0.362964 -0.353208 -0.780463 -0.224705 -0.215506 -0.113141 0.263298 0.270498 0.287214 0.230596 0.294685 0.252107 0.269002 0.246102 0.258274 0.258813
chargesum: 0.00000
title: Mulliken charges with hydrogens summed into heavy atoms:
elementType: Cl Cl Cl O N C C C C C C C C C C C C C C C C C
charge: 0.000722 -0.033212 -0.046556 -0.204162 -0.009244 0.337578 0.236026 -0.018644 0.052790 -0.121528 0.366964 -0.034739 -0.244040 0.100831 -0.175424 0.033046 -0.132368 -0.058523 -0.013252 0.033569 0.043307 -0.113141
polarizability: 4.42493298e+02 -5.74162021e+00 2.52233099e+02 5.92692061e-01 -5.89526448e+00 8.86804122e+01
1716.lowfreq: -5.0085 -2.9584 -0.0022 -0.0018 -0.0009 1.3385 21.9298 24.4530 48.5668
frequency: 21.8975 24.4384 48.5639 54.9097 61.3928 98.6418 129.9529 146.1724 165.1730 166.5713 186.9565 191.8383 209.8775 222.6163 267.3777 274.0601 313.8793 336.3759 361.8318 389.5451 401.7645 406.9318 435.4204 445.6162 473.1043 491.7623 522.0319 545.4315 561.3944 568.6300 624.7450 628.0810 663.2848 677.3103 681.7591 730.3682 746.8686 778.4052 792.0094 826.9673 831.9582 852.9221 863.7689 870.0594 871.2119 925.2521 958.8741 976.2157 996.1547 998.7837 1009.3375 1020.2960 1064.0443 1075.1090 1096.5665 1113.8202 1148.8810 1186.4110 1202.1132 1236.8997 1279.2454 1298.5902 1304.7746 1332.3318 1352.4432 1366.1371 1377.3313 1388.4449 1403.7271 1424.2734 1451.1342 1461.9225 1473.7199 1493.8390 1521.3020 1559.2062 1578.1656 1590.0668 1599.8183 1602.4330 2987.5320 3080.2204 3120.1395 3149.3315 3159.8084 3172.3645 3175.8816 3179.0507 3184.3712 3204.4234
redmass: 4.1358 13.5866 4.1457 11.8754 12.7914 8.2644 6.6832 6.9372 9.8446 6.3600 9.5959 3.5101 1.2828 10.2276 6.3144 6.2497 5.8851 6.2440 9.3710 7.1176 9.6289 2.9025 5.9946 5.0309 8.6048 3.5161 4.2413 5.5369 3.6347 4.5014 6.2699 5.1601 4.6233 7.1536 4.0247 3.1967 9.2113 7.3039 4.2118 1.3696 7.0640 1.4487 1.6320 5.8381 1.4472 1.6012 1.3721 2.3204 3.6441 1.4093 3.2985 1.8555 3.8254 2.4539 1.9526 1.3755 3.6957 1.1749 1.7703 2.0748 2.7384 1.3755 3.3446 5.2909 2.9081 6.2984 1.2223 8.4300 3.7375 3.5194 1.0989 1.0935 3.1522 3.6986 8.7270 7.6393 7.6517 7.2425 8.0805 6.6231 1.0393 1.0927 1.1021 1.0890 1.0887 1.0941 1.0934 1.0967 1.0936 1.0913
irintensity: 0.0416 0.1560 3.8708 1.8816 0.2171 0.4679 0.2205 1.7136 1.8735 0.8329 1.7371 3.6730 0.7428 0.5925 3.2677 0.7404 0.0709 4.7003 22.6381 3.5979 10.5350 0.0352 0.3481 0.4243 7.7708 13.5137 4.1924 4.4098 11.3250 19.3885 3.6119 5.2236 7.4299 36.4854 5.7598 4.4291 23.3065 15.1839 12.2045 12.1250 7.3136 43.7361 42.8994 43.3749 4.9133 18.8181 0.4583 3.6084 54.0349 2.9449 38.1479 5.6679 5.2459 80.9730 21.8807 15.0227 91.5000 20.2819 11.2122 66.3067 7.5045 3.7617 64.7134 142.7552 25.2376 82.9291 52.0214 8.0305 25.7388 0.5059 28.9073 20.4179 68.8348 10.6358 157.3058 157.6232 9.2871 10.4119 47.0376 120.2066 1.1296 7.7928 10.4436 7.3422 0.1936 2.8077 2.1552 6.0327 1.2978 2.7180
temp: 298.150 k
press: 1.00000 atm
elementType: 17 17 17 8 7 6 6 6 6 6 6 6 6 6 6 6 6 6 6 6 6 6 1 1 1 1 1 1 1 1 1 1
symmnumber: 1
zpe: 575670.9 jmol-1
zpe.correction: 0.219261 hartree
zpe.thermalcorrener: 0.238631 hartree
zpe.thermalcorrenthalpy: 0.239575 hartree
zpe.thermalcorrgfe: 0.168876 hartree
zpe.sumelectzpe: -2162.463384 hartree
zpe.sumelectthermal: -2162.444014 hartree
zpe.sumelectthermalent: -2162.443070 hartree
zpe.sumelectthermalfe: -2162.513769 hartree
dipole: 2.3288 0.9928 1.2905
dipole: 2.8415
quadrupole: -151.1137 -148.2534 -150.5978
quadrupole: 1.8820 2.3092 4.9384
quadrupole: -1.1254 1.7349 -0.6095 1.8820 2.3092 4.9384
hfenergy: -2162.6826457 hartree
pointgroup: C01 [X(C17H10Cl3N1O1)]
dipole: 0.8918279 0.4944599 0.4582206 debye
polarizability: 441.0832967|-3.3854379|241.1122233|21.8441347|-41.9025959|101.2112894 unknown
InChI: InChI=1S/C17H10Cl3NO/c1-9(22)13-8-16(10-2-4-11(18)5-3-10)21-17-14(13)6-12(19)7-15(17)20/h2-8H,1H3
charge 0 multiplicity 1
32 atoms
Cl 0.997336 -3.595456 1.171875
Cl 5.804117 -0.966931 0.471999
Cl -7.010889 -0.57346 -0.152592
O  1.058274 3.672385 -1.179406
N  -0.214682 -0.953678 0.40217
C  1.911871 0.326019 0.160489
C  1.12977 1.501359 -0.159869
C  1.154844 -0.886933 0.448869
C  -0.925758 0.146191 0.048838
C  -0.263398 1.386486 -0.23418
C  -2.40583 0.000949 -0.010976
C  3.341375 0.279778 0.161324
C  1.895481 -2.076552 0.782652
C  1.680506 2.895845 -0.39987
C  3.987306 -0.91159 0.477802
C  3.287727 -2.106016 0.803228
C  -3.255653 1.050049 -0.456962
C  -2.997723 -1.231567 0.384319
C  2.903987 3.400064 0.357915
C  -4.654944 0.881306 -0.503877
C  -4.392741 -1.414239 0.34505
C  -5.204673 -0.35023 -0.098873
H  -0.82804 2.283706 -0.498363
H  3.932814 1.155103 -0.106854
H  3.829107 -3.021843 1.051693
H  -2.844421 2.009822 -0.784062
H  -2.338104 -2.036974 0.719438
H  3.107838 2.836063 1.281832
H  2.740303 4.464195 0.596457
H  3.800392 3.356131 -0.290605
H  -5.303645 1.690314 -0.850737
H  -4.84205 -2.362695 0.652575
