program: Gaussian 09
title: 000270174
version: EM64L-G09RevD.01
frameworkgroup: C1[X(C17H9BrCl3NO)]
method: RPBEPBE
basis: SDD
operation: Freq
keyword: #p
keyword: freq=noraman
keyword: PBEPBE/SDD
title: #p freq=noraman PBEPBE/SDD
converged: YES YES NO NO
title: Mulliken charges:
elementType: Br Cl Cl Cl O N C C C C C C C C C C C C C C C C C H H H H H H H H H
charge: 0.039427 0.004443 -0.028722 -0.043997 -0.161084 -0.006364 0.352647 0.293391 -0.016427 0.054012 -0.379470 0.367460 -0.351574 -0.239732 0.106471 -0.171718 -0.244457 -0.359347 -0.351597 -0.784055 -0.224964 -0.215545 -0.113541 0.252017 0.263236 0.287717 0.226876 0.295220 0.318496 0.312889 0.258907 0.259387
chargesum: 0.00000
title: Mulliken charges with hydrogens summed into heavy atoms:
elementType: Br Cl Cl Cl O N C C C C C C C C C C C C C C C C C
charge: 0.039427 0.004443 -0.028722 -0.043997 -0.161084 -0.006364 0.352647 0.293391 -0.016427 0.054012 -0.127453 0.367460 -0.088338 -0.239732 0.106471 -0.171718 0.043259 -0.132471 -0.056377 -0.152670 0.033943 0.043842 -0.113541
polarizability: 4.37993355e+02 -3.81625442e+01 2.58037367e+02 1.66588289e+01 3.11048486e+01 1.31699650e+02
1716.lowfreq: -2.6859 -0.0015 -0.0012 -0.0009 4.1417 5.5530 15.6295 21.9936 23.1694
frequency: 15.4915 21.9034 23.1144 34.3105 56.2936 61.6163 93.4492 98.0618 129.9155 146.5810 164.7629 172.9749 184.1847 195.5967 220.8142 257.2074 273.9457 308.7923 332.0946 359.8479 388.1158 399.5812 406.3472 430.7240 458.2504 473.6151 489.3368 497.0696 541.3103 551.2858 566.2601 575.3032 625.7358 653.6086 676.9903 680.9948 727.6494 743.0271 764.0482 783.5683 795.0233 825.4669 833.1988 853.3936 866.1670 870.2646 873.8138 896.9836 920.3790 957.3065 993.3330 999.0835 1000.1056 1057.7050 1075.0848 1077.3585 1096.1776 1115.3458 1163.2387 1187.7780 1201.7595 1218.0646 1246.2722 1278.7511 1300.2448 1304.7172 1338.1752 1353.7990 1369.7807 1390.5252 1404.4027 1425.3204 1428.8153 1473.3071 1493.7465 1521.4734 1569.0273 1578.8957 1588.8966 1595.4323 1602.5585 3075.4525 3149.4069 3159.9539 3165.6800 3174.2023 3174.3031 3177.1478 3179.9008 3183.0643
redmass: 5.2892 8.9753 15.1938 19.6162 10.3964 13.9430 7.5512 11.3688 9.6557 7.0225 17.9810 8.5353 10.4869 4.9214 12.3925 6.4509 6.9504 6.0654 5.2650 11.2829 7.7560 9.2638 2.8912 5.7964 5.7990 8.6885 3.8959 4.7579 6.5213 5.0731 3.8560 5.2929 7.1733 6.8371 4.7090 6.0957 3.2187 8.3462 7.0257 6.5146 4.2657 1.3837 7.0031 1.4504 1.7890 4.0214 1.4480 1.7809 1.6959 1.3771 5.1853 2.1751 1.9049 3.4726 2.4797 1.7935 1.8543 1.3786 2.3534 1.1863 1.6618 1.1891 2.0254 2.7166 1.3577 3.6618 4.3773 3.0132 6.5143 8.9724 3.8051 2.4869 1.2920 3.7889 3.5106 8.7073 7.9693 7.5327 8.0249 8.1056 6.5685 1.0551 1.0889 1.0887 1.0952 1.0983 1.1061 1.0940 1.0952 1.0936
irintensity: 0.1343 0.2261 0.3301 0.2990 1.4120 0.0674 1.7301 2.2118 2.1374 1.9323 0.8227 4.1568 2.1694 2.5014 0.4307 3.6113 1.2200 0.4766 4.7314 24.0442 4.7227 8.9063 0.0331 0.5891 2.5781 7.4136 13.1276 3.9938 10.4859 9.8861 5.9914 22.3775 0.8439 20.7698 13.2136 26.5088 2.6893 23.9898 13.4126 11.3624 11.0418 11.4180 8.0230 47.2553 42.2444 39.7132 2.2665 1.7476 11.5574 0.1867 15.0560 33.4232 25.1576 25.3183 71.0857 59.6160 17.5599 13.9710 60.1589 20.3443 10.9625 6.9943 45.0918 6.7860 2.6000 61.6106 149.9489 6.9251 82.7068 7.7566 24.4130 8.5195 22.8438 62.9228 12.8209 163.6856 117.8868 32.6996 37.6219 70.5444 123.3426 3.8556 7.3522 0.1880 3.9784 1.4293 1.9185 3.1699 5.1570 1.3141
temp: 298.150 k
press: 1.00000 atm
elementType: 35 17 17 17 8 7 6 6 6 6 6 6 6 6 6 6 6 6 6 6 6 6 6 1 1 1 1 1 1 1 1 1
symmnumber: 1
zpe: 551263.5 jmol-1
zpe.correction: 0.209965 hartree
zpe.thermalcorrener: 0.230655 hartree
zpe.thermalcorrenthalpy: 0.231599 hartree
zpe.thermalcorrgfe: 0.155405 hartree
zpe.sumelectzpe: -2175.244853 hartree
zpe.sumelectthermal: -2175.224164 hartree
zpe.sumelectthermalent: -2175.223219 hartree
zpe.sumelectthermalfe: -2175.299414 hartree
dipole: 2.0648 0.0731 -0.1902
dipole: 2.0748
quadrupole: -164.2844 -164.0802 -170.1400
quadrupole: -1.9563 -0.1287 0.4626
quadrupole: 1.8838 2.0880 -3.9717 -1.9563 -0.1287 0.4626
hfenergy: -2175.4548182 hartree
pointgroup: C01 [X(C17H9Br1Cl3N1O1)]
dipole: 0.7991148 0.0767994 -0.1478456 debye
polarizability: 444.3438929|-17.9287994|260.9366328|-1.1814503|-0.0826038|122.4498462 unknown
InChI: InChI=1S/C17H9BrCl3NO/c18-8-16(23)12-7-15(9-1-3-10(19)4-2-9)22-17-13(12)5-11(20)6-14(17)21/h1-7H,8H2
charge 0 multiplicity 1
32 atoms
Br 1.726963 3.498867 -2.607979
Cl 0.819911 -3.953662 -0.337698
Cl 5.716722 -1.453611 0.19486
Cl -7.07092 -0.38001 0.178995
O  1.476514 3.512398 0.98427
N  -0.29269 -1.162899 -0.060233
C  1.88671 0.031748 0.057972
C  1.159022 1.277074 0.131249
C  1.079535 -1.173248 -0.059492
C  -0.954735 0.012844 0.077928
C  -0.236833 1.254076 0.176585
C  -2.441144 -0.050232 0.105376
C  3.31004 -0.067355 0.153036
C  1.773735 -2.431285 -0.157332
C  1.815065 2.637321 0.142161
C  3.909903 -1.320737 0.069185
C  3.163271 -2.519643 -0.101482
C  -3.249627 1.104787 0.290682
C  -3.082897 -1.310708 -0.05339
C  2.809736 2.989628 -0.964554
C  -4.6562 1.010397 0.314911
C  -4.485785 -1.420615 -0.032687
C  -5.255547 -0.253372 0.151197
H  -0.767632 2.205343 0.257026
H  3.927192 0.814998 0.341258
H  3.668564 -3.485909 -0.171083
H  -2.801772 2.09423 0.424298
H  -2.455264 -2.195559 -0.19179
H  3.386777 3.886315 -0.69927
H  3.44283 2.159438 -1.302925
H  -5.2733 1.90135 0.459374
H  -4.973043 -2.391869 -0.156747
