program: Gaussian 09
title: 000277292
version: EM64L-G09RevD.01
frameworkgroup: C1[X(C6H6NO2S)]
method: RPBEPBE
basis: SDD
operation: Freq
keyword: #p
keyword: freq=noraman
keyword: PBEPBE/SDD
title: #p freq=noraman PBEPBE/SDD
converged: YES YES NO NO
title: Mulliken charges:
elementType: S O O N C C C C C C H H H H H H
charge: 0.712915 -0.722718 -0.722769 -0.698845 -0.255080 0.461812 -0.209061 -0.209439 -0.409608 -0.409605 0.267189 0.267116 0.189090 0.189140 0.274932 0.274933
chargesum: -1.00000
title: Mulliken charges with hydrogens summed into heavy atoms:
elementType: S O O N C C C C C C
charge: 0.712915 -0.722718 -0.722769 -0.148980 -0.255080 0.461812 0.058127 0.057678 -0.220518 -0.220466
polarizability: 1.55105517e+02 -7.08278204e-03 1.09893854e+02 -6.24608322e-01 3.48686301e-04 4.51176804e+01
1716.lowfreq: -10.4262 0.0009 0.0025 0.0031 3.8976 10.9693 36.9233 89.3445 127.7453
frequency: 36.8827 89.3437 127.7446 182.3530 258.9718 280.8101 288.4279 310.2000 332.4181 387.0767 402.7380 423.8620 523.3013 567.4737 624.3641 711.7817 729.0768 772.7611 792.8921 803.1903 812.2100 928.8419 941.7323 987.7458 1015.9506 1039.8453 1099.0476 1156.1258 1270.8294 1270.9391 1385.0666 1402.0044 1464.7884 1587.9906 1598.1048 1627.5154 3078.5983 3081.3695 3114.8301 3117.5936 3548.9232 3691.8918
redmass: 5.8432 5.8566 7.9837 7.9288 2.1815 2.0567 3.5589 1.2057 17.3768 2.9652 2.6838 10.2905 2.6062 6.3076 6.9666 8.5425 3.5672 15.0670 3.7580 1.2887 2.0429 1.3973 1.3788 4.9815 1.4228 2.3766 1.1825 1.1327 1.3401 2.7911 9.1843 2.8542 2.8723 7.6641 5.1869 1.1890 1.0880 1.0876 1.0923 1.0944 1.0440 1.1028
irintensity: 2.5604 10.0248 0.1257 3.8780 118.3215 265.5720 1.4878 5.5194 25.0863 1.0569 0.0349 38.6694 36.7670 13.1469 0.6847 44.5416 8.3118 112.0229 33.0550 0.0224 72.3804 0.2868 1.0717 0.0431 0.0814 10.6041 17.0228 21.9993 3.5557 72.1952 5.4689 1.5886 68.5021 7.8931 68.5838 169.6381 47.8705 48.4905 22.3911 29.6377 12.9448 6.9761
temp: 298.150 k
press: 1.00000 atm
elementType: 16 8 8 7 6 6 6 6 6 6 1 1 1 1 1 1
symmnumber: 1
zpe: 286311.9 jmol-1
zpe.correction: 0.109050 hartree
zpe.thermalcorrener: 0.119193 hartree
zpe.thermalcorrenthalpy: 0.120137 hartree
zpe.thermalcorrgfe: 0.072892 hartree
zpe.sumelectzpe: -834.715352 hartree
zpe.sumelectthermal: -834.705209 hartree
zpe.sumelectthermalent: -834.704265 hartree
zpe.sumelectthermalfe: -834.751510 hartree
dipole: 12.0144 -0.0011 -1.8495
dipole: 12.1559
quadrupole: -92.0548 -74.8061 -73.7102
quadrupole: 0.0096 11.7233 0.0192
quadrupole: -11.8644 5.3843 6.4802 0.0096 11.7233 0.0192
hfenergy: -834.8244021 hartree
pointgroup: C01 [X(C6H6N1O2S1)]
dipole: -4.7116507 0.1350574 -0.8089344 debye
dipolederiv: 1.1584745 -0.0087419 0.030696 0.0012655 0.8985706 -0.044251 0.1438026 -0.0495735 0.4556802 -0.7497717 -0.0881858 0.0485185 -0.3090334 -0.8532887 0.047402 -0.1204196 -0.1734254 -0.5990994 -0.7157122 0.0847404 0.0293389 0.272085 -0.8532433 -0.0046807 -0.1587108 0.2322382 -0.6331764 -1.5946349 0.061254 -0.0824566 0.0464056 -0.0797569 -0.0597997 -0.2357898 -0.0529525 -0.7237054 -0.3369244 -0.0062253 -0.0535843 0.0064793 -0.3590591 0.0201167 0.0824522 0.0141021 -0.1790854 1.5320654 -0.0726913 -0.0306371 -0.0770801 0.0050113 0.0120028 -0.0700841 0.0139167 0.110139 -0.0131813 -0.08088 -0.0229088 -0.0757121 0.1227549 -0.04461 0.0091795 0.0494189 -0.1167074 0.0017615 0.0858426 -0.0373496 0.0862899 0.0983489 0.0031717 -0.0137435 -0.0931294 -0.1071531 -0.3661745 0.0484061 -0.0130191 -0.2727926 0.0755961 -0.0033711 0.0387993 -0.032759 -0.2651008 -0.3427952 -0.0128304 -0.0099142 0.3131452 0.0455876 -0.0600793 -0.0185649 -0.0327163 -0.2593016 0.1271973 -0.1030498 0.0298234 -0.017636 -0.0042464 0.0206856 0.0062405 -0.0046721 0.1473001 0.1370746 0.0939555 0.0098069 0.0058495 -0.0119879 0.0081889 0.0054267 0.0346346 0.1447119 -0.0869833 0.150737 -0.0070677 0.1538126 -0.1388833 0.0164516 0.0101021 0.0054671 0.1642925 -0.1144973 -0.151096 0.0239176 -0.1507471 -0.1044627 0.0390706 0.0424659 0.0485117 0.1575746 0.1837121 -0.0045456 0.0413044 0.0486155 0.0701062 -0.0069686 0.1335293 -0.0264256 0.3595943 0.1803894 0.0033106 0.0435318 -0.0309468 0.0889528 0.0566705 0.1453146 0.0673645 0.344037 unknown
polarizability: 154.9756294|-1.8256372|109.3548444|2.3091623|-6.367778|45.7865774 unknown
InChI: InChI=1S/C6H6NO2S/c7-5-1-3-6(4-2-5)10(8)9/h1-4H,7H2
charge -1 multiplicity 1
16 atoms
S  2.574721 -0.1639 -0.336294
O  2.949853 1.340302 0.360211
O  2.821375 -1.534438 0.637653
N  -3.606657 0.153509 0.047572
C  0.624704 -0.067886 -0.247925
C  -2.195592 0.080896 -0.037797
C  -0.013553 1.184684 -0.303244
C  -0.12397 -1.244737 -0.064385
C  -1.421493 1.264843 -0.200485
C  -1.532552 -1.176692 0.039794
H  0.61784 2.081053 -0.365913
H  0.423418 -2.189445 0.053737
H  -1.927731 2.24108 -0.233241
H  -2.124372 -2.091224 0.193593
H  -4.051119 1.059975 0.164691
H  -4.12997 -0.669521 0.333433
