program: Gaussian 09
title: 000277413
version: EM64L-G09RevD.01
frameworkgroup: C1[X(C12H11F15N2O2)]
method: RPBEPBE
basis: SDD
operation: Freq
keyword: #p
keyword: freq=noraman
keyword: PBEPBE/SDD
title: #p freq=noraman PBEPBE/SDD
converged: YES YES NO NO
title: Mulliken charges:
elementType: F F F F F F F F F F F F F F F O O N N C C C C C C C C C C C C H H H H H H H H H H H
charge: -0.133619 -0.122707 -0.126480 -0.114640 -0.125106 -0.138133 -0.118064 -0.118962 -0.173914 -0.148108 -0.123729 -0.120551 -0.121517 -0.122822 -0.125888 -0.296285 -0.254298 -0.413734 -0.388243 0.253385 0.242506 0.226924 0.256905 0.309200 0.208625 -0.466157 0.372875 0.336683 -0.305103 -0.256576 -0.658438 0.298186 0.278799 0.312427 0.299154 0.231511 0.242168 0.217103 0.221139 0.230330 0.224133 0.211022
chargesum: 0.00000
title: Mulliken charges with hydrogens summed into heavy atoms:
elementType: F F F F F F F F F F F F F F F O O N N C C C C C C C C C C C C
charge: -0.133619 -0.122707 -0.126480 -0.114640 -0.125106 -0.138133 -0.118064 -0.118962 -0.173914 -0.148108 -0.123729 -0.120551 -0.121517 -0.122822 -0.125888 -0.296285 -0.254298 -0.101307 -0.089089 0.253385 0.242506 0.226924 0.256905 0.309200 0.208625 0.110828 0.372875 0.336683 0.168577 0.181666 0.007048
polarizability: 1.84486142e+02 7.69032271e+00 1.59337229e+02 2.07750125e+00 1.58618808e+00 1.36368552e+02
1716.lowfreq: -7.9876 -4.5213 0.0005 0.0007 0.0010 5.1357 6.7667 13.8878 23.7993
frequency: 3.8197 13.4990 23.7795 30.5284 36.8549 41.6315 48.5875 57.9963 67.3156 74.9628 87.9139 90.8175 115.1553 115.6537 125.9659 131.7152 141.4202 158.7828 173.4648 194.8631 197.5904 211.7879 231.9697 234.0990 235.6953 247.3406 250.4817 256.8453 276.0076 278.7487 290.4447 290.8281 299.5937 305.9757 314.5936 317.6632 330.4157 338.3122 342.6169 366.7846 386.5092 394.7308 398.6154 412.8682 424.8917 446.5359 463.4341 478.1034 507.0361 514.2556 539.5001 557.5948 559.8745 575.7165 586.5475 589.4786 603.3689 654.3509 661.5125 711.1226 726.3281 769.8836 804.2442 809.8152 856.0803 858.8564 903.9498 924.6418 961.8008 966.1011 979.6501 999.9792 1012.7339 1018.1500 1028.5756 1029.1533 1042.3059 1045.1123 1050.5529 1072.9021 1081.3979 1084.2582 1088.0156 1100.1187 1112.0248 1127.3511 1138.2109 1146.5293 1153.1109 1162.3846 1165.7613 1186.9891 1190.2022 1227.9031 1272.1015 1277.7384 1297.0285 1362.6933 1369.9246 1387.8702 1391.6047 1437.0580 1441.4728 1461.4082 1464.7420 1471.9774 1483.8488 1505.0471 1640.6359 2986.9779 2991.0668 3013.0100 3013.5998 3058.8863 3078.4377 3081.5556 3096.9240 3102.7789 3541.0041 3568.2458
redmass: 5.8099 6.3380 8.8864 6.3606 12.2583 5.6183 12.5791 2.7504 6.0882 10.7859 5.5724 11.4594 9.6383 10.8439 18.1161 12.2250 8.3953 9.8907 13.4411 16.1754 3.0486 17.2467 1.9858 3.2401 5.5797 13.5705 13.0808 13.3251 14.6125 15.6279 17.6262 15.9732 16.9058 17.5480 7.1799 16.4618 17.6111 3.6721 2.1369 6.0197 1.7596 3.0153 6.2395 10.7595 14.1895 14.4565 17.5118 3.4632 5.7824 17.3269 2.2477 16.2024 5.6860 7.9050 16.8137 14.4685 2.5579 16.3623 4.4325 8.5472 6.8733 2.6535 1.2300 12.1616 3.0901 11.7452 7.1098 5.4196 10.0767 3.2916 13.4696 9.7517 9.7083 4.5666 11.6301 11.4592 8.3262 9.6379 7.4699 6.3828 2.7496 12.8707 2.1769 2.6074 11.9538 10.7865 10.4927 10.1036 10.9723 1.8675 6.7645 3.7288 12.2121 1.7376 1.1476 1.2625 1.0992 1.2110 1.3242 1.2218 1.1729 1.0982 1.0879 1.1691 1.0617 1.3022 1.0682 2.1360 5.0728 1.0397 1.0557 1.0598 1.0597 1.1054 1.1023 1.0975 1.1066 1.1025 1.0774 1.0778
irintensity: 0.2148 0.1208 0.2800 0.7367 0.1055 1.2741 0.2555 1.1407 4.4670 0.5479 9.8474 3.5334 1.4084 1.5678 0.9991 4.9299 2.0460 5.2121 2.9223 14.8371 0.7556 8.6623 0.6167 0.6667 0.8362 2.0897 0.0755 0.4352 2.6859 1.8530 0.3022 1.3998 0.1971 0.5901 5.2280 1.2388 0.4596 12.3524 12.5441 2.2487 3.5819 4.6104 9.6914 3.9618 1.2397 2.3190 7.2647 33.0754 21.0226 0.5699 99.1169 2.4075 76.8098 38.2109 0.9506 8.0798 78.3513 49.6630 15.2020 2.9875 65.7450 20.2739 5.6933 260.7348 15.1811 26.8501 55.6717 159.3914 83.6239 59.4058 3.8115 52.6637 128.7208 150.7985 59.9678 107.6199 84.3060 98.4047 2.5444 143.6486 249.8990 285.1580 81.7024 22.0730 7.2645 25.8284 26.7620 27.4598 5.8110 22.0454 5.8950 11.6629 48.8395 156.2974 21.1931 88.3903 16.6022 9.5590 18.4269 7.8532 14.2909 39.2204 9.0517 22.3431 10.4601 9.6428 6.2371 505.1350 143.3382 28.6263 27.1177 57.2887 19.8022 12.1120 6.4552 35.0139 17.0292 59.3014 14.8766 26.5986
temp: 298.150 k
press: 1.00000 atm
elementType: 9 9 9 9 9 9 9 9 9 9 9 9 9 9 9 8 8 7 7 6 6 6 6 6 6 6 6 6 6 6 6 1 1 1 1 1 1 1 1 1 1 1
symmnumber: 1
zpe: 648622.9 jmol-1
zpe.correction: 0.247047 hartree
zpe.thermalcorrener: 0.279874 hartree
zpe.thermalcorrenthalpy: 0.280818 hartree
zpe.thermalcorrgfe: 0.178208 hartree
zpe.sumelectzpe: -2218.984406 hartree
zpe.sumelectthermal: -2218.951579 hartree
zpe.sumelectthermalent: -2218.950635 hartree
zpe.sumelectthermalfe: -2219.053245 hartree
dipole: -2.5301 2.2653 0.5044
dipole: 3.4332
quadrupole: -169.6753 -174.2318 -185.0085
quadrupole: -15.7170 -4.6528 -1.0389
quadrupole: 6.6299 2.0734 -8.7033 -15.7170 -4.6528 -1.0389
hfenergy: -2219.2314531 hartree
pointgroup: C01 [X(C12H11F15N2O2)]
dipole: 0.8681888 1.0003756 -0.2645503 debye
polarizability: 185.9100065|-3.5085949|157.2592491|4.2686807|-3.3570972|137.0226673 unknown
InChI: InChI=1S/C12H11F15N2O2/c1-2-31-4-29-5(30)28-3-6(13,14)7(15,16)8(17,18)9(19,20)10(21,22)11(23,24)12(25,26)27/h28-29H,2-4H2,1H3
charge 0 multiplicity 1
42 atoms
F  -0.533933 1.704344 1.685014
F  -2.415911 1.483214 0.409471
F  -1.795799 -0.641706 2.00648
F  0.294385 -0.815361 1.107346
F  -0.922198 1.263271 -1.895083
F  -0.548969 3.121116 -0.616174
F  -0.789213 -1.444398 -1.386677
F  -1.339558 -2.789669 0.370901
F  1.611595 2.273543 -2.02978
F  1.534739 0.186636 -1.116916
F  -3.212465 -2.629715 -1.564534
F  -3.320872 -0.350993 -1.45843
F  -5.438867 -1.919457 -0.295338
F  -3.987041 -2.675751 1.274215
F  -4.404958 -0.449584 1.078022
O  3.818955 0.378836 1.745665
O  6.70415 -1.308757 0.161687
N  3.524252 1.936783 0.028206
N  5.612975 0.886386 0.317648
C  -1.063224 1.089252 0.515513
C  -1.042279 -0.461545 0.816742
C  -0.299208 1.721232 -0.713177
C  -1.579823 -1.525637 -0.219456
C  1.254863 1.552541 -0.835356
C  -3.086805 -1.51777 -0.699385
C  2.111926 2.078761 0.327575
C  -4.239296 -1.6420 0.36765
C  4.298082 1.015974 0.758712
C  6.531536 -0.081872 0.924587
C  5.552906 -2.250951 0.206166
C  4.696673 -2.169053 -1.065592
H  1.921556 1.489952 1.24245
H  1.827304 3.130166 0.514141
H  3.92648 2.484711 -0.732609
H  5.898807 1.311824 -0.566601
H  7.542968 0.353695 0.964201
H  6.150394 -0.286523 1.942303
H  6.013355 -3.251052 0.295481
H  4.944352 -2.051684 1.110039
H  4.153816 -1.211112 -1.135115
H  5.331361 -2.282408 -1.962112
H  3.947188 -2.983034 -1.068678
