program: Gaussian 09
title: 000270127
version: EM64L-G09RevD.01
frameworkgroup: C1[X(C23H30N2O4S)]
method: RPBEPBE
basis: SDD
operation: Freq
keyword: #p
keyword: freq=noraman
keyword: PBEPBE/SDD
title: #p freq=noraman PBEPBE/SDD
converged: YES YES NO NO
title: Mulliken charges:
elementType: S O O O O N N C C C C C C C C C C C C C C C C C C C C C C C H H H H H H H H H H H H H H H H H H H H H H H H H H H H H H
charge: 0.933365 -0.535212 -0.541580 -0.352773 -0.228964 -0.530650 -0.461075 -0.118938 -0.413491 -0.387214 -0.400262 -0.421445 -0.381546 -0.047529 -0.252473 -0.209781 -0.322675 -0.435429 0.510684 -0.215912 0.452465 0.169763 -0.705680 -0.698091 -0.384032 -0.495664 0.478841 -0.456754 0.218605 -0.808800 0.248047 0.190853 0.264091 0.222364 0.197481 0.185575 0.213349 0.207983 0.205719 0.192850 0.205163 0.304757 0.290214 0.279411 0.308219 0.237129 0.218689 0.207802 0.215495 0.226649 0.259251 0.209119 0.206472 0.340088 0.232516 0.251031 0.230957 0.224948 0.237265 0.228763
chargesum: 0.00000
title: Mulliken charges with hydrogens summed into heavy atoms:
elementType: S O O O O N N C C C C C C C C C C C C C C C C C C C C C C C
charge: 0.933365 -0.535212 -0.541580 -0.352773 -0.228964 -0.225893 -0.120987 0.129110 0.041453 0.032631 -0.001338 -0.007743 0.016467 -0.047529 0.037740 0.069630 -0.014456 -0.198299 0.510684 0.002777 0.452465 0.169763 -0.055735 -0.023250 -0.151516 -0.244633 0.478841 -0.225798 0.218605 -0.117825
polarizability: 4.46774323e+02 -1.05051347e+01 2.74528748e+02 -1.35425451e+01 -6.05721316e+00 2.36792637e+02
1716.lowfreq: -28.0453 -15.6138 -9.0092 -4.9038 -3.3999 -0.0003 0.0008 0.0013 4.1553
frequency: -28.0008 -12.4861 -5.1598 13.6073 32.2774 34.8429 37.1662 48.8784 56.1947 73.1934 79.3950 82.5122 101.0001 108.2969 133.0205 147.9740 157.8467 182.6077 196.7673 203.5401 209.6219 226.7657 237.6386 242.9765 257.4654 262.2669 275.0462 288.7185 296.7887 301.1834 327.8898 348.3741 381.2017 391.4924 392.9354 404.4919 405.2636 413.6478 422.8114 463.4412 467.5393 469.4105 481.0821 506.3260 525.5741 534.3412 574.3978 575.4648 617.3108 618.9083 648.8128 660.7958 689.9747 694.4288 699.0475 726.2282 732.9460 759.0237 770.8805 771.8290 794.3344 823.9780 827.8608 828.3238 831.4364 841.4938 864.2036 871.0668 876.9566 883.9435 889.0265 904.1598 920.8311 922.2270 930.3208 955.2461 955.3135 957.1551 961.6417 967.8183 990.1285 996.4386 1004.5480 1009.5675 1041.0156 1047.9509 1050.6858 1051.6015 1057.3165 1078.1812 1087.4081 1108.6293 1115.6419 1122.6955 1139.2148 1139.5436 1146.8508 1148.9306 1170.1084 1187.4444 1207.1161 1226.4120 1247.8325 1253.2890 1262.9852 1265.9430 1269.7050 1277.8084 1285.7617 1299.4802 1304.0510 1327.1621 1327.6806 1329.8469 1339.4560 1345.5987 1352.7680 1376.9456 1378.0836 1381.0291 1382.3545 1395.3796 1398.0076 1407.4430 1409.4168 1445.4871 1462.1998 1468.1349 1468.2824 1469.6824 1470.9000 1471.0034 1474.5824 1476.2225 1477.4082 1480.2838 1486.4642 1501.6544 1511.5533 1578.7304 1599.5147 1602.9044 1629.6843 1680.3196 2953.7961 2965.9251 2969.2359 2974.6744 2976.8033 2977.4974 2978.3967 2978.6790 3005.8314 3009.7794 3031.5370 3032.4218 3040.4473 3057.1505 3057.9794 3060.3215 3066.1752 3074.8950 3079.7212 3086.9600 3089.7505 3122.6623 3132.1377 3142.2338 3147.5211 3156.8431 3169.0601 3192.7041 3350.5930 3537.2017
redmass: 1.0238 3.8082 4.7311 4.4128 4.3073 4.2036 4.2341 3.7044 5.0140 4.9689 4.5313 3.9371 6.2875 4.1728 6.2527 4.7666 5.6755 6.4685 3.5663 3.2538 2.2703 1.2096 3.8198 3.8845 1.3149 3.3637 3.1463 3.3799 5.1324 3.3040 5.2359 2.6320 4.3921 3.2864 3.2363 3.1296 3.5938 3.0215 5.2214 2.5712 3.9161 2.8346 4.0518 3.6650 3.6779 3.0478 5.2329 3.4092 6.8599 1.8698 1.5178 6.6846 3.5330 5.4247 3.5967 3.5810 5.5485 3.9400 3.3821 1.5394 14.9431 2.3998 1.5513 1.4256 1.3533 4.6870 2.3929 1.4101 2.0307 2.1227 1.8654 4.2938 1.4202 1.1804 10.4625 1.4786 1.3960 1.9528 1.3491 3.3801 4.8916 1.3238 1.6968 2.7362 1.4112 1.5762 1.8077 1.9058 2.3853 2.3320 1.7079 1.0884 2.5857 1.3539 2.4469 2.5504 1.8853 1.6436 1.5409 1.1265 1.4906 1.2664 4.6455 1.3549 1.2156 1.9476 1.3551 1.5933 1.4909 1.3635 1.3782 1.3229 1.7350 1.4533 1.5146 1.4566 1.4247 1.2047 1.2982 3.7040 2.7289 1.2354 1.2630 3.6059 3.8279 1.0861 1.0853 1.0525 1.0850 1.0499 1.0790 1.0507 1.1091 2.1557 1.0905 1.0546 1.2493 2.0694 2.3981 6.1011 6.0860 5.8252 7.2504 8.9648 1.0685 1.0642 1.0624 1.0351 1.0637 1.0355 1.0375 1.0648 1.0836 1.0846 1.0965 1.0941 1.1001 1.0982 1.0971 1.0995 1.1001 1.0989 1.1003 1.0990 1.1002 1.0869 1.0900 1.0927 1.0959 1.0910 1.0957 1.0949 1.0735 1.0761
irintensity: 0.5145 0.5376 0.6559 0.1116 1.3621 0.6360 0.4291 0.1424 0.4037 0.3827 2.8309 1.3611 4.9013 0.5873 1.5365 0.6355 2.1336 2.4132 0.3286 4.4226 0.1489 0.0855 0.8888 0.1064 1.2510 4.0725 1.7604 33.5180 6.0442 15.2096 14.1573 10.4338 6.0131 2.1823 5.2748 7.7723 9.1633 0.3828 20.3237 24.2748 1.6102 77.4966 8.0352 7.0767 19.3833 81.8799 30.7062 5.4714 1.3103 17.9155 24.1647 6.2311 0.6651 6.0446 53.0390 0.2330 8.4130 3.4905 44.3013 8.8958 100.9463 81.6729 7.5669 30.5012 34.0328 7.6057 17.1473 45.0278 28.3967 2.2941 5.2492 37.4856 18.3592 1.3973 49.6114 0.1936 1.0777 9.0496 0.8025 212.8854 1.9343 0.8912 45.5857 9.1942 1.3775 14.7837 0.3626 128.5072 33.6114 175.2714 0.2837 3.1263 2.2493 61.9119 260.5388 350.7654 43.1024 3.7335 0.5005 16.4959 1.0489 9.5868 71.8211 4.5265 4.3294 6.3121 15.7198 10.9305 5.7410 24.9730 3.5314 2.2938 45.0124 0.2742 2.0643 1.6553 1.3848 15.6886 19.0264 209.7080 16.4758 20.7363 9.3456 33.5170 10.4096 8.7196 6.9905 5.6132 8.4346 0.6236 19.3415 17.3370 37.0773 3.5718 15.1872 4.7982 4.5115 234.6272 577.9699 1.4927 61.0235 156.8461 9.1365 204.5698 23.7981 34.8980 29.1368 24.0501 4.9950 50.3412 28.1395 41.1583 12.9872 38.5775 63.0729 66.5600 70.4021 19.4528 19.7695 34.8399 2.7662 93.5809 27.6121 19.2790 25.3702 11.9216 12.6446 19.5988 13.0142 4.1932 4.1895 4.5750 19.2826 39.3095
temp: 298.150 k
press: 1.00000 atm
elementType: 16 8 8 8 8 7 7 6 6 6 6 6 6 6 6 6 6 6 6 6 6 6 6 6 6 6 6 6 6 6 1 1 1 1 1 1 1 1 1 1 1 1 1 1 1 1 1 1 1 1 1 1 1 1 1 1 1 1 1 1
symmnumber: 1
zpe: 1282936.3 jmol-1
zpe.correction: 0.488645 hartree
zpe.thermalcorrener: 0.517118 hartree
zpe.thermalcorrenthalpy: 0.518062 hartree
zpe.thermalcorrgfe: 0.428262 hartree
zpe.sumelectzpe: -1700.517822 hartree
zpe.sumelectthermal: -1700.489349 hartree
zpe.sumelectthermalent: -1700.488404 hartree
zpe.sumelectthermalfe: -1700.578205 hartree
dipole: 3.5628 4.1532 2.6631
dipole: 6.0856
quadrupole: -168.3793 -192.1959 -186.7385
quadrupole: -28.2628 -2.5321 -5.3320
quadrupole: 14.0586 -9.7580 -4.3006 -28.2628 -2.5321 -5.3320
hfenergy: -1701.0064667 hartree
pointgroup: C01 [X(C23H30N2O4S1)]
dipole: 1.4855295 -1.461296 -1.1791057 debye
polarizability: 445.1930988|19.2406457|276.9142748|13.8931048|-2.1945741|235.9883341 unknown
InChI: InChI=1S/C23H30N2O4S/c1-16(2)21-14-9-17(3)15-22(21)29-23(26)24-18-10-12-20(13-11-18)30(27,28)25-19-7-5-4-6-8-19/h9-16,19,24-25H,4-8H2,1-3H3
charge 0 multiplicity 1
60 atoms
S  -4.440833 1.32866 0.305011
O  -4.565469 1.361719 1.936105
O  -5.076595 2.502116 -0.632123
O  3.727571 0.695529 -0.917627
O  2.526125 0.271658 1.082223
N  -5.142701 -0.24574 -0.431324
N  1.489642 0.920633 -0.952755
C  -5.288804 -1.38986 0.527391
C  -6.492367 -1.258743 1.501818
C  -5.399342 -2.685236 -0.32463
C  -7.850518 -1.369665 0.768014
C  -6.761665 -2.797478 -1.051309
C  -7.942863 -2.675963 -0.057428
C  -2.612456 1.159247 -0.074817
C  -1.738526 0.838217 0.9750
C  -2.174816 1.40985 -1.386287
C  -0.357656 0.745087 0.707707
C  -0.796822 1.320395 -1.650243
C  0.117092 0.984482 -0.610899
C  4.591783 -2.116387 -0.482996
C  5.440789 -0.900887 -0.106407
C  4.997136 0.430923 -0.285501
C  5.33832 -3.055911 -1.466115
C  4.133943 -2.883455 0.787723
C  6.732779 -1.049565 0.459694
C  5.771121 1.55375 0.057442
C  7.059502 1.386758 0.62002
C  7.525998 0.061777 0.814718
C  2.555695 0.594747 -0.124306
C  7.897238 2.590567 1.013924
H  -4.347887 -1.427396 1.109798
H  -6.416768 -2.079032 2.244417
H  -6.40868 -0.308451 2.059296
H  -4.564646 -2.715204 -1.047737
H  -5.281354 -3.547726 0.362679
H  -7.995973 -0.496766 0.095335
H  -8.673447 -1.320372 1.505815
H  -6.813592 -3.761771 -1.59173
H  -6.841713 -2.003955 -1.822523
H  -7.923532 -3.54259 0.635694
H  -8.906234 -2.720877 -0.600864
H  -6.051057 0.07349 -0.824189
H  -2.13052 0.689613 1.986474
H  -2.887192 1.683685 -2.170085
H  0.3490 0.498586 1.502247
H  -0.426812 1.513631 -2.664192
H  3.684685 -1.752957 -1.002043
H  6.246145 -3.485445 -1.003475
H  4.684735 -3.897507 -1.761276
H  5.646015 -2.518086 -2.380914
H  3.582482 -2.214248 1.470475
H  3.474827 -3.727889 0.512611
H  5.002747 -3.295358 1.334562
H  1.751008 1.150665 -1.91447
H  7.125681 -2.059592 0.623553
H  5.360199 2.554457 -0.116294
H  8.519725 -0.099028 1.249031
H  8.926275 2.294591 1.280144
H  7.462206 3.110218 1.888796
H  7.957274 3.328588 0.193249
