program: Gaussian 09
title: 000277712
version: EM64L-G09RevD.01
frameworkgroup: C1[X(C26H23N2O6P)]
method: RPBEPBE
basis: SDD
operation: Freq
keyword: #p
keyword: freq=noraman
keyword: PBEPBE/SDD
title: #p freq=noraman PBEPBE/SDD
converged: NO YES NO NO
title: Mulliken charges:
elementType: P O O O O O O N N C C C C C C C C C C C C C C C C C C C C C C C C C C H H H H H H H H H H H H H H H H H H H H H H H
charge: 1.135575 -0.568889 -0.543394 -0.591948 -0.265049 -0.206101 -0.200822 -0.367800 0.024421 -0.633122 0.538714 0.479505 -0.430904 -0.313157 -0.358334 -0.368889 0.389765 -0.407025 -0.360520 0.398707 0.377845 -0.329407 -0.364852 0.316819 -0.364943 -0.366801 -0.343997 -0.341595 -0.193889 -0.200342 -0.195452 -0.206724 -0.244049 -0.251398 -0.537374 0.316759 0.328943 0.250628 0.283168 0.290101 0.291086 0.223476 0.285698 0.251890 0.244222 0.251478 0.246814 0.269180 0.290992 0.230028 0.233166 0.230088 0.229051 0.230278 0.230651 0.220033 0.222365 0.245335
chargesum: 0.00000
title: Mulliken charges with hydrogens summed into heavy atoms:
elementType: P O O O O O O N N C C C C C C C C C C C C C C C C C C C C C C C C C C
charge: 1.135575 -0.568889 -0.543394 -0.591948 -0.265049 -0.206101 -0.200822 -0.038857 0.024421 -0.316363 0.538714 0.479505 -0.180277 -0.029989 -0.068233 -0.077803 0.389765 -0.183549 -0.074822 0.398707 0.377845 -0.077517 -0.120630 0.316819 -0.113465 -0.119988 -0.074817 -0.050603 0.036139 0.032823 0.034636 0.022327 -0.013771 -0.020748 0.150359
polarizability: 5.50698274e+02 -3.41734386e+00 3.28453639e+02 9.19147866e+00 -7.54959994e+00 2.80843947e+02
1716.lowfreq: -9.1271 -6.3191 -4.2535 -2.1807 -0.0012 -0.0011 -0.0009 5.0050 9.7207
frequency: -7.2154 2.6010 9.6160 15.4558 19.3737 25.4096 32.8301 34.3235 39.0231 53.8134 67.6953 73.5417 87.0990 100.3820 101.8514 116.6423 127.0784 139.4959 145.8346 169.2858 172.2934 198.1856 220.8262 228.9090 235.3120 240.6764 276.0638 282.5340 293.8395 343.6626 365.0309 380.5428 389.5294 405.9232 409.1756 411.0744 414.4295 423.8387 456.6395 460.2243 475.5168 478.9715 485.8601 500.7277 514.1106 521.6343 528.6782 542.7111 548.9669 595.0012 607.3144 609.5054 626.8131 639.0491 641.4877 647.9176 655.1706 670.0794 690.3461 693.4634 716.6710 732.5121 749.3588 764.2873 770.7386 777.8536 804.9804 814.8328 819.2195 821.5974 823.6962 835.3785 838.3547 850.7421 855.4786 883.0266 911.9220 915.7121 929.5016 946.9223 969.1361 971.2533 985.4373 986.6238 987.0579 987.2747 990.5084 991.6934 994.4239 998.3417 1006.3020 1017.1367 1019.5875 1021.5659 1074.0159 1076.7149 1091.8650 1110.6780 1112.6102 1114.1736 1142.2548 1154.1916 1158.1291 1162.1034 1170.1572 1171.0844 1181.0438 1181.9100 1184.9517 1188.5098 1191.9065 1219.8632 1229.5767 1241.1579 1281.8352 1298.6582 1306.9918 1310.5087 1311.0964 1319.9377 1368.0616 1378.2250 1380.9938 1382.3232 1402.6891 1421.7994 1428.5177 1437.6533 1438.7782 1439.9899 1464.9043 1468.0361 1469.8920 1472.0399 1480.2633 1496.4382 1512.9621 1589.9870 1593.1822 1594.9463 1597.0519 1599.4361 1600.7163 1609.9845 1632.3890 2956.9705 3043.4669 3051.3436 3122.3685 3124.2140 3124.5960 3130.2543 3131.1181 3140.1707 3142.0100 3147.3967 3148.7433 3157.2694 3158.0433 3166.7906 3168.7060 3169.6323 3170.8522 3176.3392 3176.6446 3184.6299 3187.0674 3552.8498
redmass: 3.7866 6.4216 6.8632 5.8443 6.3989 4.9366 6.3373 5.1100 4.1422 6.4057 5.8635 5.5052 4.0713 5.9764 6.9057 7.5431 5.7166 5.3754 6.8561 7.3574 5.3642 2.6699 6.5938 1.6050 5.3108 4.6455 6.1272 5.7608 5.5601 7.4760 4.1564 4.4512 7.2150 2.8850 2.8994 2.9463 3.1003 7.3977 5.8884 4.0540 2.2472 3.3107 3.9471 6.9411 5.1530 2.4564 5.0140 3.4453 4.2657 6.0810 6.6606 6.5956 7.3630 7.3659 8.5523 7.2924 7.7665 4.4171 2.0969 2.2254 3.6411 5.2694 4.8669 1.5549 1.6357 7.6435 1.3125 5.7939 6.3558 1.8890 4.6516 1.2494 1.2523 1.3829 1.9417 2.4563 1.4183 1.4453 1.3815 1.3494 1.3783 1.3809 4.5871 1.4060 6.9683 3.5256 1.3936 1.5579 1.4155 2.7501 2.9294 7.2678 2.1626 2.3945 1.5240 1.5342 3.2880 1.3727 1.2608 1.5999 2.1146 2.4556 1.3541 1.6544 1.1102 1.1242 1.3150 1.4661 1.3840 1.5206 1.4585 4.7949 1.8863 2.5278 1.5658 1.8139 1.3252 1.4016 1.3561 1.6054 7.2053 8.5406 8.7533 4.6663 7.2468 3.2255 3.3553 1.1677 2.2194 2.2692 1.0498 2.1954 2.1077 1.1150 2.3181 1.7707 2.3924 6.3620 5.4599 6.2970 7.3656 6.3604 6.4948 6.3478 6.2368 1.0332 1.1038 1.0876 1.0898 1.0918 1.0991 1.0851 1.0851 1.0897 1.0897 1.0884 1.0908 1.0940 1.0941 1.0950 1.0969 1.0963 1.0954 1.0990 1.1001 1.0945 1.0950 1.0764
irintensity: 0.0768 0.0761 0.4553 0.0472 0.0243 0.2063 0.3484 0.3574 0.3273 1.6555 1.0428 1.4611 4.3227 2.2930 3.5723 10.6692 5.7897 7.1895 0.5437 15.8541 8.0369 3.0505 2.4416 1.8951 4.0182 28.5957 2.5587 5.0718 0.9537 8.6494 20.5198 44.8318 6.0542 0.2817 0.4940 0.2210 1.4071 24.2378 14.4961 61.6982 42.4529 40.9040 12.3489 5.6423 2.9093 16.7973 6.2609 63.2609 11.6215 87.4888 11.0349 0.7969 39.2679 34.1345 29.7283 12.0033 83.8693 40.5273 33.0782 30.2954 0.6160 15.7396 1.8049 76.8706 90.8506 23.2755 15.8185 216.9891 198.6017 101.8623 8.4569 2.8407 1.1312 10.4599 27.1790 21.3315 7.4873 9.2512 2.3492 0.8799 0.8420 1.0603 1.7615 1.6635 37.7796 7.4666 0.8053 0.4797 1.6283 24.1942 4.0173 55.9856 23.2990 34.7257 9.2169 14.2837 23.7656 16.9507 0.3240 54.6856 251.9802 189.6399 48.1226 48.2995 14.7662 14.8446 41.5824 51.1105 129.7492 50.5466 68.9064 420.0005 184.7828 31.6769 8.4247 28.1877 0.0864 12.4490 1.4690 38.8981 92.9601 2.4157 2.0825 18.5189 0.5952 50.1980 29.2638 23.7867 5.6647 8.1826 13.9295 125.0454 129.2570 43.7713 15.8735 5.7000 460.7958 28.4555 5.7027 40.6726 3.7078 31.7484 30.2812 75.3502 8.3209 81.4479 47.7759 1.9169 13.8781 2.9256 30.4479 0.6665 0.4430 12.4431 13.9411 10.6375 3.1953 27.4013 35.4399 5.7686 6.9093 6.9762 9.5814 6.7715 5.8546 0.9436 4.3936 31.0299
temp: 298.150 k
press: 1.00000 atm
elementType: 15 8 8 8 8 8 8 7 7 6 6 6 6 6 6 6 6 6 6 6 6 6 6 6 6 6 6 6 6 6 6 6 6 6 6 1 1 1 1 1 1 1 1 1 1 1 1 1 1 1 1 1 1 1 1 1 1 1
symmnumber: 1
zpe: 1141902.4 jmol-1
zpe.correction: 0.434928 hartree
zpe.thermalcorrener: 0.466823 hartree
zpe.thermalcorrenthalpy: 0.467767 hartree
zpe.thermalcorrgfe: 0.363836 hartree
zpe.sumelectzpe: -1904.055661 hartree
zpe.sumelectthermal: -1904.023766 hartree
zpe.sumelectthermalent: -1904.022822 hartree
zpe.sumelectthermalfe: -1904.126753 hartree
dipole: 4.4701 0.7250 -1.6690
dipole: 4.8263
quadrupole: -223.0695 -208.8010 -201.5143
quadrupole: -8.3062 -10.7121 -3.3861
quadrupole: -11.9412 2.3273 9.6140 -8.3062 -10.7121 -3.3861
hfenergy: -1904.4905889 hartree
pointgroup: C01 [X(C26H23N2O6P1)]
dipole: 0.4768971 1.7381199 -0.5974469 debye
polarizability: 358.266603|78.4386432|516.8687872|20.5329823|16.2447419|284.8604707 unknown
InChI: InChI=1S/C14H13N2O3.C12H10O3P/c1-19-14-8-4-12(5-9-14)15-10-11-2-6-13(7-3-11)16(17)18;13-16(14-11-7-3-1-4-8-11)15-12-9-5-2-6-10-12/h2-10,15H,1H3;1-10H
charge 0 multiplicity 1
58 atoms
P  -0.556242 0.390363 0.100552
O  -0.581104 1.768269 -0.995392
O  -1.787007 -0.554895 -0.760239
O  -0.850931 0.659689 1.645862
O  5.084756 4.891905 0.951122
O  0.727862 -6.699177 -1.799652
O  0.205833 -6.750391 0.41982
N  2.25729 0.004362 0.574023
N  0.543492 -6.125058 -0.65754
C  1.261128 -0.373378 -0.363482
C  1.072328 -1.874329 -0.443913
C  2.907025 1.263407 0.631232
C  1.299986 -2.560442 -1.661995
C  0.658209 -2.601532 0.704615
C  1.130863 -3.955723 -1.740251
C  0.487436 -3.996717 0.644511
C  0.729695 -4.653648 -0.580762
C  3.942127 1.446042 1.592409
C  2.584836 2.331385 -0.241469
C  -1.685879 2.67282 -1.033699
C  -2.588824 -1.569776 -0.167547
C  4.637156 2.661055 1.673709
C  3.291725 3.553622 -0.166872
C  4.320426 3.724194 0.788813
C  -2.448086 2.721628 -2.219062
C  -2.833833 -2.709057 -0.968039
C  -1.964484 3.516792 0.064159
C  -3.154328 -1.441004 1.123034
C  -3.503571 3.655689 -2.315801
C  -3.660656 -3.738322 -0.467189
C  -3.031538 4.43782 -0.042224
C  -3.969721 -2.487461 1.612017
C  -3.79801 4.513328 -1.229216
C  -4.22711 -3.634356 0.825827
C  4.781799 6.018359 0.066347
H  1.443149 0.078742 -1.353212
H  2.410632 -0.625974 1.362262
H  1.612783 -2.001647 -2.550425
H  0.426696 -2.071969 1.637511
H  1.303249 -4.507799 -2.667601
H  0.153508 -4.574622 1.509806
H  4.204892 0.628225 2.275022
H  1.764523 2.245285 -0.960527
H  5.432638 2.809095 2.409939
H  3.015761 4.360819 -0.851969
H  -2.214015 2.031166 -3.034789
H  -2.382331 -2.769579 -1.963234
H  -1.359944 3.449328 0.974119
H  -2.953179 -0.549587 1.723871
H  -4.101607 3.704682 -3.232372
H  -3.858108 -4.621221 -1.085186
H  -3.260669 5.096819 0.802453
H  -4.410419 -2.397767 2.611266
H  -4.62209 5.230924 -1.305019
H  -4.864076 -4.436849 1.212832
H  4.943669 5.751312 -0.996477
H  3.740851 6.371143 0.204221
H  5.483742 6.812711 0.359499
