program: Gaussian 09
title: 000270116
version: EM64L-G09RevD.01
frameworkgroup: C1[X(C19H30N2O4S)]
method: RPBEPBE
basis: SDD
operation: Freq
keyword: #p
keyword: freq=noraman
keyword: PBEPBE/SDD
title: #p freq=noraman PBEPBE/SDD
converged: YES YES NO NO
title: Mulliken charges:
elementType: S O O O O N N C C C C C C C C C C C C C C C C C C C H H H H H H H H H H H H H H H H H H H H H H H H H H H H H H
charge: 0.932855 -0.537004 -0.540617 -0.303286 -0.263437 -0.531841 -0.464637 -0.118023 -0.412470 -0.385556 -0.401292 -0.421148 -0.381511 -0.046123 -0.206459 -0.255524 -0.363346 -0.350789 -0.434044 -0.334481 -0.372909 0.502813 -0.355025 -0.309521 -0.693393 0.259744 0.250404 0.260907 0.191134 0.196834 0.221431 0.213008 0.185320 0.206939 0.207238 0.204762 0.193083 0.303296 0.277408 0.291736 0.187995 0.198071 0.195057 0.189506 0.230517 0.207603 0.235986 0.310372 0.194599 0.197192 0.235772 0.226553 0.335412 0.217158 0.209911 0.211820
chargesum: 0.00000
title: Mulliken charges with hydrogens summed into heavy atoms:
elementType: S O O O O N N C C C C C C C C C C C C C C C C C C C
charge: 0.932855 -0.537004 -0.540617 -0.303286 -0.263437 -0.228545 -0.129225 0.132381 0.039571 0.032709 -0.002964 -0.006972 0.016334 -0.046123 0.070949 0.036213 0.022720 0.033773 -0.198057 -0.024109 0.065210 0.502813 0.036766 0.152805 -0.054504 0.259744
polarizability: 3.92074113e+02 1.96903531e+01 2.10101652e+02 7.37961165e-01 -6.21139801e+00 2.22753351e+02
1716.lowfreq: -7.9106 -1.1613 0.0001 0.0010 0.0017 4.5724 12.6784 14.4556 17.7317
frequency: 10.6897 13.2157 17.4786 26.3063 33.9944 43.3947 51.3407 61.0560 74.9643 83.2294 92.5059 101.7675 114.6513 121.3842 130.3841 134.5581 151.9906 178.9290 189.7274 208.6193 231.0264 240.9982 248.0767 259.3626 269.1202 293.8319 299.4385 334.9680 351.0282 369.7481 381.4181 394.6044 409.5274 413.9728 418.9992 427.4667 463.9030 465.7584 506.1178 510.6407 533.9747 614.6152 621.7306 647.1480 652.0505 677.2896 705.3847 727.0202 728.0968 751.4457 770.3399 774.9909 795.2352 798.6646 820.3591 824.6449 825.4117 829.7246 863.2165 872.4172 875.9742 882.2692 889.8111 900.9841 923.7102 931.9328 952.3696 956.4502 988.0340 991.3707 998.3452 1000.3210 1009.2980 1011.3753 1042.2519 1044.0112 1049.4892 1056.8381 1068.3916 1085.3601 1086.4326 1109.0831 1120.2812 1121.8563 1138.4503 1149.2718 1162.6685 1169.8809 1185.3508 1205.1055 1228.1640 1238.5950 1253.1911 1255.6258 1262.4585 1264.8603 1267.2492 1283.9155 1288.5255 1292.8958 1294.4649 1297.3588 1299.6242 1327.4304 1334.0574 1341.0747 1341.5083 1346.7892 1352.5832 1355.5579 1368.7340 1379.6128 1384.7472 1389.2057 1409.8693 1449.7962 1455.2370 1461.1257 1466.1910 1467.4910 1471.9699 1472.7455 1474.9383 1475.7200 1477.4654 1483.4522 1484.6198 1489.6600 1514.3516 1599.0499 1603.1389 1663.5309 2956.0990 2956.1089 2960.5426 2966.7834 2969.8463 2973.4715 2973.6964 2977.8153 2979.2174 2990.4682 2993.9719 3009.9672 3010.8368 3023.5733 3031.1670 3031.7952 3033.2737 3040.5662 3053.8625 3054.1725 3058.9783 3070.1379 3073.0305 3102.7874 3129.9509 3156.5306 3169.9818 3191.8272 3349.8752 3540.2049
redmass: 4.5443 4.7512 4.1505 4.0272 4.2173 1.6300 4.8613 3.8085 5.4572 4.8501 4.4503 3.8407 3.1512 2.1684 2.5718 5.0795 4.4069 7.5238 6.3995 3.1404 1.1452 3.9737 3.3128 4.0172 3.8303 4.6597 3.3151 5.9058 2.8481 4.4223 3.9243 3.1323 3.2684 3.0991 2.8605 6.1109 3.9313 2.1066 3.6837 4.0845 2.9763 6.8249 1.8246 3.8466 1.5904 5.5393 4.4752 3.4154 1.0687 1.1006 3.3954 1.5052 10.8956 1.2235 2.5083 3.5058 1.4915 1.7000 2.4066 1.3936 2.0010 2.0948 1.5084 2.9079 1.4114 10.3814 1.3974 2.0251 3.5506 1.5606 1.3212 3.4711 2.7234 3.8452 1.4301 3.6212 1.7805 2.3928 2.8173 2.2180 1.7239 1.0798 2.1952 1.4477 2.1620 1.6349 3.1042 1.9524 1.1269 1.4509 1.2612 1.2761 1.3463 1.2653 1.2747 1.8363 1.3569 1.0624 1.4940 1.1713 1.1693 1.3436 1.1718 1.3263 1.4421 1.4100 1.5059 1.4561 1.4284 1.6309 1.5001 1.2372 3.3036 1.2156 4.4517 1.0861 1.0906 1.0870 1.0669 1.0737 1.0825 1.0861 1.1082 2.0608 1.0439 1.0801 1.0876 1.0945 2.4323 6.1260 5.7594 7.6881 1.0586 1.0682 1.0589 1.0619 1.0592 1.0363 1.0633 1.0632 1.0647 1.0638 1.0928 1.1012 1.0845 1.0580 1.0966 1.0944 1.1040 1.1005 1.0992 1.1037 1.1001 1.1007 1.0993 1.1085 1.0902 1.0909 1.0955 1.0950 1.0738 1.0761
irintensity: 0.1432 0.8706 0.4743 0.0240 2.0645 0.2090 0.1427 0.1492 1.1644 2.7536 1.8653 0.6599 0.4337 0.2283 0.3913 1.2035 1.0510 2.5548 0.3173 3.5292 0.0652 0.7812 3.7138 0.7867 6.1518 9.3242 48.9308 27.8182 6.3831 10.9110 1.9794 5.1582 4.9353 0.7094 1.9900 28.4747 73.3843 30.6721 7.8630 24.0141 88.4159 1.0513 18.5681 22.6049 21.3236 17.2047 49.5281 0.7633 12.6509 0.4640 48.9858 5.8060 87.8334 6.8157 50.9895 48.3197 41.4718 2.5023 13.3676 47.0986 27.6464 2.6155 4.1542 3.5456 18.4557 49.8284 1.0746 11.2949 29.7253 22.3942 0.9713 161.3595 14.1123 72.7195 1.3389 84.7978 0.2261 24.4884 21.2276 0.3833 0.3477 2.6926 52.3185 12.0920 13.1215 4.5414 578.3480 44.5880 15.1764 3.5472 10.2683 10.5206 7.1405 5.9669 6.6055 8.4859 12.5065 1.2780 6.0563 0.4472 4.2270 29.6986 0.3118 1.1405 0.2808 0.2865 2.1277 1.7744 0.8211 0.9293 74.4189 9.5640 156.3177 11.0507 28.5040 8.6162 13.1572 7.7777 0.6403 0.6426 19.3574 7.1203 1.1211 1.9509 11.8979 3.8964 18.1744 23.0108 759.2519 79.4354 137.8364 179.4664 2.7267 22.8881 6.3553 41.2695 93.0562 36.0153 26.2828 5.6034 37.2699 21.0728 6.0636 0.5019 36.7638 49.8172 64.8728 62.9253 36.1475 68.4738 13.8186 37.6855 48.1037 90.5625 54.2970 29.6741 13.4652 4.7630 3.2287 4.9864 19.2826 38.2645
temp: 298.150 k
press: 1.00000 atm
elementType: 16 8 8 8 8 7 7 6 6 6 6 6 6 6 6 6 6 6 6 6 6 6 6 6 6 6 1 1 1 1 1 1 1 1 1 1 1 1 1 1 1 1 1 1 1 1 1 1 1 1 1 1 1 1 1 1
symmnumber: 1
zpe: 1227787.5 jmol-1
zpe.correction: 0.467640 hartree
zpe.thermalcorrener: 0.496130 hartree
zpe.thermalcorrenthalpy: 0.497074 hartree
zpe.thermalcorrgfe: 0.403157 hartree
zpe.sumelectzpe: -1548.313451 hartree
zpe.sumelectthermal: -1548.284960 hartree
zpe.sumelectthermalent: -1548.284016 hartree
zpe.sumelectthermalfe: -1548.377933 hartree
dipole: -3.4196 -5.6635 1.2543
dipole: 6.7337
quadrupole: -137.1475 -179.4670 -162.6264
quadrupole: -15.0798 -9.2862 -3.7097
quadrupole: 22.5995 -19.7200 -2.8795 -15.0798 -9.2862 -3.7097
hfenergy: -1548.7810901 hartree
pointgroup: C01 [X(C19H30N2O4S1)]
dipole: -1.4301147 2.1700448 -0.5139447 debye
polarizability: 393.1512953|-13.5116949|208.7132388|-3.1805701|-5.7102166|223.0645815 unknown
InChI: InChI=1S/C19H30N2O4S/c1-2-3-4-8-15-25-19(22)20-16-11-13-18(14-12-16)26(23,24)21-17-9-6-5-7-10-17/h11-14,17,20-21H,2-10,15H2,1H3
charge 0 multiplicity 1
56 atoms
S  3.493232 -1.225403 -0.609542
O  3.539514 -1.880238 0.889177
O  3.917749 -2.081474 -1.930213
O  -4.244821 1.678755 -1.172823
O  -3.167563 0.789328 0.728489
N  4.529118 0.32814 -0.74796
N  -2.119176 0.969255 -1.394186
C  4.830791 1.009721 0.553646
C  5.967928 0.339974 1.374234
C  5.179779 2.487908 0.224662
C  7.344063 0.476205 0.678226
C  6.556378 2.621416 -0.470278
C  7.677687 1.955182 0.364435
C  1.763703 -0.532847 -0.828907
C  1.380492 -0.078497 -2.102575
C  0.900583 -0.525557 0.277306
C  -7.704265 0.760669 0.30335
C  -8.584046 -0.509365 0.261861
C  0.075037 0.417975 -2.260535
C  -0.408464 -0.026688 0.117177
C  -6.355377 0.571373 -0.430822
C  -0.823967 0.452592 -1.155645
C  -9.936725 -0.337617 0.99019
C  -5.501607 1.844163 -0.383724
C  -10.807911 -1.611419 0.942984
C  -3.165175 1.103916 -0.486559
H  3.892747 0.987449 1.141328
H  5.711318 -0.718586 1.560719
H  6.013552 0.841529 2.362346
H  5.196409 3.04982 1.180811
H  4.379222 2.917136 -0.40424
H  8.127845 0.031261 1.320001
H  7.357263 -0.11262 -0.264428
H  6.511824 2.154564 -1.475669
H  6.786449 3.691343 -0.634416
H  8.645186 2.025697 -0.168971
H  7.795821 2.508668 1.3192
H  5.381848 -0.00692 -1.239306
H  2.076791 -0.121121 -2.945169
H  1.243934 -0.918794 1.23979
H  -8.261872 1.606235 -0.1512
H  -7.515624 1.039414 1.360748
H  -8.02823 -1.354914 0.717344
H  -8.771561 -0.792735 -0.794869
H  -5.79335 -0.259991 0.035554
H  -6.540768 0.296153 -1.487322
H  -0.250877 0.778982 -3.243317
H  -1.106325 -0.006304 0.956178
H  -10.491275 0.508626 0.535374
H  -9.748772 -0.055207 2.046174
H  -5.232219 2.106854 0.655248
H  -6.005278 2.694713 -0.872165
H  -2.334969 1.289041 -2.341221
H  -11.766987 -1.466067 1.473116
H  -11.038524 -1.895879 -0.101101
H  -10.286632 -2.465419 1.415196
