program: Gaussian 09
title: 000270101
version: EM64L-G09RevD.01
frameworkgroup: C1[X(C15H20N2O4S)]
method: RPBEPBE
basis: SDD
operation: Freq
keyword: #p
keyword: freq=noraman
keyword: PBEPBE/SDD
title: #p freq=noraman PBEPBE/SDD
converged: YES YES NO NO
title: Mulliken charges:
elementType: S O O O O N N C C C C C C C C C C C C C C C H H H H H H H H H H H H H H H H H H H H
charge: 0.910039 -0.535247 -0.541450 -0.305967 -0.266419 -0.247656 -0.461761 -0.424463 -0.445628 -0.378566 -0.382075 -0.384594 -0.047841 -0.249766 -0.215614 -0.431896 -0.336515 0.500436 0.285900 -0.360032 -0.041466 -0.523411 0.231218 0.241324 0.281070 0.231652 0.197827 0.252609 0.233799 0.204529 0.183561 0.221716 0.297292 0.274955 0.235682 0.309070 0.335150 0.241525 0.227764 0.229910 0.221567 0.231773
chargesum: 0.00000
title: Mulliken charges with hydrogens summed into heavy atoms:
elementType: S O O O O N N C C C C C C C C C C C C C C C
charge: 0.910039 -0.535247 -0.541450 -0.305967 -0.266419 -0.247656 -0.126611 0.048079 0.067094 0.071870 0.056253 0.020683 -0.047841 0.047526 0.059341 -0.196214 -0.027445 0.500436 0.285900 0.109257 0.188444 -0.070071
polarizability: 3.23191386e+02 8.38252565e-01 1.77828853e+02 5.44912126e+00 2.01488848e+01 1.82041137e+02
1716.lowfreq: -2.1556 -0.0019 -0.0008 -0.0005 3.8911 11.0863 19.8657 27.1301 38.2600
frequency: 19.6330 27.0486 38.1710 40.6424 46.2342 60.3044 83.0504 86.0077 97.5698 103.7947 143.7103 155.0831 178.6552 190.9392 202.4271 242.2107 265.7858 297.4593 306.3420 312.7531 314.2845 354.7723 365.4561 384.8468 399.1089 411.8147 414.6077 424.4007 441.6940 462.0922 499.2743 530.9302 596.1214 613.4510 626.8321 646.4321 664.7907 687.2413 705.9991 724.6995 777.7280 785.8672 791.6431 819.6870 836.6191 846.2374 850.5241 854.5606 876.5394 884.0075 918.3306 920.8854 934.8431 963.1017 968.2048 972.0358 983.6421 985.2066 991.1898 1001.2923 1005.8499 1035.3025 1057.4832 1063.1378 1103.5018 1120.7565 1131.8920 1149.8417 1156.7579 1162.6408 1184.7513 1191.0492 1249.5679 1252.5989 1263.7355 1270.2617 1286.6353 1289.4613 1301.2726 1323.9839 1338.4882 1341.8057 1342.3698 1348.6763 1362.6960 1379.5383 1408.4211 1426.7051 1439.4661 1444.8416 1458.2187 1458.4691 1467.8557 1471.5916 1476.5393 1511.9564 1598.1547 1602.3212 1659.1163 1667.6757 2963.7323 2967.4780 2975.2942 2986.6321 2991.5705 3033.5972 3037.5934 3041.0414 3048.1967 3060.5663 3063.8327 3094.6175 3102.5884 3121.9632 3128.7628 3160.5594 3165.7589 3193.4896 3207.2031 3539.4609
redmass: 4.9184 4.6629 4.0665 4.5804 3.5541 3.9732 6.7719 5.3961 3.3456 3.8026 4.3326 4.7074 5.6240 8.8464 3.9627 4.4155 4.8167 2.7747 3.4710 4.8103 4.6004 4.3498 2.8581 3.1947 2.8258 2.9727 2.5555 4.0151 3.4265 3.3367 3.7250 2.8724 2.3552 6.3188 3.2371 1.4565 3.1692 3.7392 4.8833 3.4495 4.3731 1.6355 8.4176 4.9635 1.3035 1.9887 1.5739 1.8360 2.7563 6.0964 1.9252 4.3549 1.4306 2.1328 1.3354 1.3482 1.4865 4.0044 5.0847 1.1950 2.3785 2.0357 2.3777 1.7971 2.0952 1.3290 2.1740 1.4255 3.4455 2.0727 1.1270 1.6115 1.2977 1.1597 1.9682 1.1708 1.2455 1.2154 1.3801 1.2096 1.3943 1.3703 1.2230 1.4304 1.3223 4.6125 4.5340 1.1568 1.0789 1.0793 1.1272 1.0835 1.0832 1.0915 2.2255 2.3918 6.0186 5.8709 4.8074 7.4528 1.0648 1.0640 1.0661 1.0610 1.0620 1.0574 1.0961 1.0971 1.1014 1.0992 1.1022 1.0644 1.0991 1.0992 1.0899 1.0951 1.0909 1.0956 1.1152 1.0761
irintensity: 0.6625 1.1828 0.3766 0.7422 0.1733 0.0153 7.2194 1.3037 0.5492 0.1276 1.8899 1.0313 1.2649 1.5216 4.4793 16.7464 10.3048 0.8382 30.7196 8.6258 18.0117 5.3020 4.1406 2.9822 1.9125 1.1323 21.0077 12.6038 7.8446 0.3389 56.4223 68.0128 50.4947 7.0583 96.5553 28.2523 16.3603 5.5964 43.3531 3.5903 32.0035 6.9679 76.9529 41.3973 12.4949 55.8975 74.9757 0.2105 4.8492 7.0556 23.9662 58.9676 1.2788 10.2734 3.6337 168.2188 30.1732 206.7552 128.9802 17.4353 4.5905 8.7361 32.0148 8.2924 0.8361 35.9918 9.0733 3.3434 486.4850 2.0669 27.3874 10.6349 17.8854 14.9729 7.5807 7.8433 0.1700 16.9123 27.0789 0.8800 7.0931 1.8828 2.8854 2.6281 4.1705 205.7381 26.0754 11.9168 25.8437 6.8105 37.9063 12.6623 17.4654 16.6293 3.9037 701.8067 72.2399 142.2294 19.9914 154.7657 45.5676 13.4263 25.8825 24.2505 37.2769 40.6323 63.6140 22.9332 33.4032 3.5281 30.8711 4.1941 5.6033 14.7266 12.6972 9.3461 2.2857 5.0810 21.1611 39.4454
temp: 298.150 k
press: 1.00000 atm
elementType: 16 8 8 8 8 7 7 6 6 6 6 6 6 6 6 6 6 6 6 6 6 6 1 1 1 1 1 1 1 1 1 1 1 1 1 1 1 1 1 1 1 1
symmnumber: 1
zpe: 872186.2 jmol-1
zpe.correction: 0.332198 hartree
zpe.thermalcorrener: 0.354665 hartree
zpe.thermalcorrenthalpy: 0.355609 hartree
zpe.thermalcorrgfe: 0.277850 hartree
zpe.sumelectzpe: -1390.214168 hartree
zpe.sumelectthermal: -1390.191701 hartree
zpe.sumelectthermalent: -1390.190757 hartree
zpe.sumelectthermalfe: -1390.268516 hartree
dipole: -4.1649 3.5443 -3.7525
dipole: 6.6325
quadrupole: -116.9094 -139.6005 -137.9259
quadrupole: 18.1710 3.1201 5.4546
quadrupole: 14.5692 -8.1219 -6.4473 18.1710 3.1201 5.4546
hfenergy: -1390.546366 hartree
pointgroup: C01 [X(C15H20N2O4S1)]
dipole: 1.7348533 -1.0821847 -1.6211633 debye
polarizability: 319.8339154|19.3143078|182.8555854|-8.439615|-21.6222536|180.371875 unknown
InChI: InChI=1S/C15H20N2O4S/c1-2-12-21-15(18)16-13-6-8-14(9-7-13)22(19,20)17-10-4-3-5-11-17/h2,6-9,16H,1,3-5,10-12H2
charge 0 multiplicity 1
42 atoms
S  -2.853871 0.4523 0.698111
O  -3.107991 0.745856 2.281925
O  -3.661823 1.319539 -0.439049
O  5.276793 1.349214 -0.637764
O  4.222311 0.156771 1.107394
N  -3.022555 -1.450587 0.530355
N  3.025201 1.254825 -0.623243
C  -3.136858 -1.85357 -0.906549
C  -4.137258 -1.94319 1.396986
C  -4.543266 -1.68261 -1.529948
C  -5.551993 -1.765178 0.799312
C  -5.622819 -2.337407 -0.635945
C  -1.029424 0.642136 0.296233
C  -0.688116 1.375044 -0.852175
C  -0.072759 0.103618 1.172268
C  0.677062 1.564313 -1.135398
C  1.29394 0.290805 0.885911
C  1.672952 1.024301 -0.274193
C  4.164144 0.840718 0.058129
C  6.614081 0.887663 -0.133322
C  7.017507 -0.399842 -0.807677
C  7.204461 -1.564971 -0.139611
H  -2.841663 -2.923512 -0.918989
H  -2.370755 -1.302328 -1.482799
H  -4.043332 -1.434317 2.3726
H  -3.915451 -3.01918 1.554081
H  -4.543244 -2.136802 -2.539686
H  -4.755667 -0.603654 -1.645222
H  -5.808232 -0.687776 0.786072
H  -6.285785 -2.266793 1.458916
H  -5.465087 -3.436415 -0.603357
H  -6.62736 -2.169861 -1.066738
H  -1.475657 1.793974 -1.48697
H  -0.385186 -0.450564 2.06222
H  0.971626 2.135714 -2.023785
H  2.064654 -0.117845 1.541924
H  3.209426 1.801415 -1.467691
H  6.559184 0.772457 0.962435
H  7.27975 1.724719 -0.400838
H  7.160794 -0.352904 -1.896077
H  7.511581 -2.48027 -0.657968
H  7.045085 -1.634711 0.942923
