program: Gaussian 09
title: 000270093
version: EM64L-G09RevD.01
frameworkgroup: C1[X(C19H25O5P)]
method: RPBEPBE
basis: SDD
operation: Freq
keyword: #p
keyword: freq=noraman
keyword: PBEPBE/SDD
title: #p freq=noraman PBEPBE/SDD
converged: NO YES NO NO
title: Mulliken charges:
elementType: P O O O O O C C C C C C C C C C C C C C C C C C C H H H H H H H H H H H H H H H H H H H H H H H H H
charge: 1.289784 -0.535525 -0.497925 -0.604036 -0.271809 -0.220460 -0.673580 -0.601716 0.423176 0.168499 0.322294 0.399319 -0.442827 -0.400618 -0.461971 -0.247181 -0.242424 -0.227502 -0.438771 -0.277380 -0.244808 -0.261994 -0.653563 -0.662336 -0.658975 0.348418 0.251043 0.284686 0.259344 0.276000 0.239131 0.228227 0.222377 0.229205 0.226304 0.235120 0.237655 0.227017 0.228173 0.239306 0.223291 0.221203 0.213957 0.259859 0.233721 0.227667 0.207192 0.227246 0.258610 0.217573
chargesum: 0.00000
title: Mulliken charges with hydrogens summed into heavy atoms:
elementType: P O O O O O C C C C C C C C C C C C C C C C C C C
charge: 1.289784 -0.535525 -0.497925 -0.604036 -0.271809 -0.220460 -0.325162 -0.065987 0.423176 0.168499 0.322294 0.399319 -0.183483 -0.124618 -0.222840 -0.018954 0.209159 0.233922 -0.201116 -0.050363 -0.016635 0.200604 0.041456 0.006245 0.044454
polarizability: 2.67881625e+02 -1.18691129e+01 2.58265462e+02 1.26437701e+01 3.32077557e+01 2.20993206e+02
1716.lowfreq: -8.5479 -5.4802 -0.0007 0.0006 0.0014 7.4341 12.3521 21.9068 30.4096
frequency: 12.1206 21.8339 30.2480 32.9809 39.6357 50.3287 54.0779 54.9633 72.1973 89.3470 104.7353 113.6919 122.9298 131.2540 132.0658 165.9820 173.3400 179.9989 184.4685 204.9305 234.2905 244.1041 249.5006 260.4144 261.1141 298.0999 329.6951 338.9915 364.9389 384.2353 423.2646 429.0943 433.2956 444.7171 471.1363 481.3577 497.7959 508.9082 553.8009 568.4127 596.4743 614.3126 651.2187 666.9597 673.1416 703.3524 749.4650 774.5344 778.5643 786.3893 796.7443 801.8853 815.2179 816.9239 820.1805 852.6681 861.1386 873.1439 874.2827 887.9007 925.6114 966.5125 974.1242 988.3220 996.8872 1002.0646 1011.6949 1016.6100 1022.5837 1036.5621 1048.3520 1053.3342 1081.7819 1094.1333 1094.8395 1103.2549 1114.2399 1133.6994 1145.9393 1150.1737 1155.9053 1175.9801 1182.3968 1192.5258 1216.7465 1237.8256 1253.4101 1260.5002 1271.0961 1276.6649 1281.0585 1310.5503 1334.2681 1352.2663 1354.0015 1362.5397 1382.8451 1389.9002 1393.6475 1396.1619 1406.6724 1420.0971 1444.5095 1455.4240 1455.5651 1458.5628 1461.9680 1462.6621 1467.2992 1473.7027 1478.0090 1483.3199 1486.8080 1490.2933 1518.5484 1589.4014 1598.9108 1632.6286 1640.9354 2985.8350 2991.1152 2994.4215 2995.4166 3004.3237 3016.3664 3032.9343 3056.1725 3059.2171 3073.0921 3081.1764 3083.5015 3089.2865 3090.3693 3096.6318 3107.1290 3107.2714 3118.6476 3122.1506 3122.4369 3125.3063 3136.5946 3140.6167 3157.6431 3159.6503
redmass: 4.4478 4.7624 3.9955 4.3457 3.8497 2.8658 2.8154 2.8675 4.5724 4.8643 2.0619 3.2904 4.8683 4.8141 5.2255 3.5180 3.3294 4.2974 3.8745 1.6010 2.3502 1.9160 3.0743 1.8353 1.8012 2.8130 4.0828 4.5937 3.9414 4.1380 3.8817 3.9739 3.4219 4.2697 3.2796 3.4703 5.8895 5.7742 6.9713 3.6704 5.4343 5.2220 3.6737 6.4735 5.0662 4.9758 1.2585 2.5014 3.4413 3.5827 2.1042 1.1588 1.1499 1.5069 1.8368 2.6780 3.3058 3.8056 4.0511 1.7944 1.4513 1.4998 2.0692 1.3814 1.3398 2.7151 2.8070 2.7837 3.0798 5.6754 3.3628 4.1261 2.2600 2.2102 2.2009 2.2216 2.6431 1.4209 1.5447 1.4307 1.6770 1.1769 1.1946 1.2826 1.2598 1.8366 1.7834 1.1540 1.1171 1.1200 1.7431 1.4445 1.3979 1.2346 1.2839 1.2406 1.9795 1.2306 1.2405 1.2316 3.1067 4.9820 2.2418 1.0582 2.4367 1.0810 1.0452 1.0438 1.0742 1.1195 1.0505 1.0513 1.0550 1.0864 3.5889 7.4858 5.2699 6.4106 8.9931 1.0359 1.0443 1.0476 1.0364 1.0606 1.0619 1.0595 1.1064 1.0864 1.1041 1.0979 1.0997 1.0981 1.0976 1.1031 1.1029 1.1029 1.0857 1.1059 1.0866 1.0888 1.0919 1.0951 1.0994 1.1002
irintensity: 0.2560 0.7003 1.5917 0.5632 0.8515 0.2971 0.1138 0.4207 0.3325 1.3914 3.5045 3.5203 1.5482 0.3436 2.5607 3.5717 6.2614 5.5588 2.6671 3.1593 0.5010 3.1001 1.1867 4.6338 6.6593 3.7511 4.9253 22.0409 5.6419 9.3467 21.5516 18.7825 19.5123 13.9606 0.7202 9.7972 1.4987 0.6996 0.5893 6.4634 43.2426 38.1530 1.8582 77.5528 49.6944 12.9588 4.9045 19.2457 22.5183 11.7979 52.4361 9.6573 1.5169 5.5222 56.4684 24.8531 143.2588 6.2164 116.4729 1.1688 0.1731 2.7875 2.5390 4.5586 0.4692 21.7879 161.8239 86.6660 20.8577 78.2727 26.3142 26.7298 17.3438 42.6749 34.9358 5.4963 198.8100 1.4416 6.8190 2.9002 14.9983 4.2342 7.8263 39.4364 45.0182 5.4217 10.7564 1.1052 0.1742 4.5059 3.4554 66.9560 3.8450 13.1887 0.8181 5.3292 13.5013 32.2626 8.5487 39.8679 2.2212 2.0096 5.5867 17.3178 0.4216 3.3684 15.1605 11.6243 6.0852 17.1641 6.8252 15.1040 11.7492 10.2631 9.9339 0.7049 7.0295 2.1606 134.0132 18.9702 20.0418 28.4419 16.0041 36.3146 8.7396 28.1950 7.6778 1.9929 5.4414 43.5707 0.8984 29.1089 33.3314 1.4616 38.6313 21.1623 0.4067 25.2061 0.9067 5.8201 14.5054 24.2826 38.5573 23.1252
temp: 298.150 k
press: 1.00000 atm
elementType: 15 8 8 8 8 8 6 6 6 6 6 6 6 6 6 6 6 6 6 6 6 6 6 6 6 1 1 1 1 1 1 1 1 1 1 1 1 1 1 1 1 1 1 1 1 1 1 1 1 1
symmnumber: 1
zpe: 1060228.9 jmol-1
zpe.correction: 0.403820 hartree
zpe.thermalcorrener: 0.431032 hartree
zpe.thermalcorrenthalpy: 0.431977 hartree
zpe.thermalcorrgfe: 0.342603 hartree
zpe.sumelectzpe: -1454.491001 hartree
zpe.sumelectthermal: -1454.463789 hartree
zpe.sumelectthermalent: -1454.462845 hartree
zpe.sumelectthermalfe: -1454.552218 hartree
dipole: 0.9341 0.2843 5.0374
dipole: 5.1311
quadrupole: -153.4393 -134.5595 -160.1231
quadrupole: -1.3141 -11.4268 -0.3993
quadrupole: -4.0653 14.8145 -10.7492 -1.3141 -11.4268 -0.3993
hfenergy: -1454.8948212 hartree
pointgroup: C01 [X(C19H25O5P1)]
dipole: 0.6145161 -0.2366845 -1.9083057 debye
polarizability: 273.0816529|2.7197618|254.3112784|3.9799255|35.5204893|219.7473615 unknown
InChI: InChI=1S/C19H25O5P/c1-4-22-19(20)18(25(21,23-5-2)24-6-3)14-16-12-9-11-15-10-7-8-13-17(15)16/h7-13,18H,4-6,14H2,1-3H3
charge 0 multiplicity 1
50 atoms
P  -2.374998 -0.317501 0.259662
O  -1.979891 -1.905277 -0.365798
O  -3.310334 0.439114 -0.992093
O  -3.154558 -0.30149 1.642968
O  -0.739743 2.444002 -0.996692
O  -0.528066 2.605599 1.324157
C  -0.605509 0.391952 0.227538
C  0.207386 -0.226936 1.399503
C  1.706349 -0.075831 1.179945
C  2.409116 -0.927237 0.24395
C  -0.621325 1.913495 0.287436
C  3.836383 -0.740519 0.057584
C  2.416396 0.90429 1.88557
C  1.752676 -1.958552 -0.513265
C  4.519824 0.277408 0.801748
C  3.822226 1.084457 1.700135
C  -2.882436 -3.046146 -0.014183
C  -2.894461 0.321373 -2.424257
C  4.54136 -1.580584 -0.867062
C  2.468398 -2.760463 -1.406766
C  3.874373 -2.571862 -1.588902
C  -0.849736 3.936987 -1.092695
C  -2.435616 -3.715109 1.287508
C  -4.034216 0.923365 -3.241431
C  -2.29847 4.384329 -0.883173
H  -0.209307 0.081574 -0.754114
H  -0.063913 -1.293219 1.502188
H  -0.097418 0.282465 2.328915
H  1.876439 1.551042 2.586167
H  0.676806 -2.128462 -0.391281
H  5.598413 0.409002 0.653484
H  4.344979 1.860733 2.26933
H  -2.794727 -3.724034 -0.880274
H  -3.925882 -2.68551 0.060535
H  -2.732601 -0.74597 -2.666523
H  -1.951527 0.881542 -2.566839
H  5.620096 -1.43023 -0.996501
H  1.95033 -3.542608 -1.972996
H  4.422256 -3.208445 -2.292382
H  -0.174557 4.381062 -0.340611
H  -0.484684 4.155428 -2.108718
H  -1.379049 -4.029819 1.222886
H  -3.051288 -4.614487 1.478696
H  -2.557377 -3.024503 2.139215
H  -4.9736 0.372039 -3.067294
H  -4.195947 1.978924 -2.963121
H  -3.791249 0.877244 -4.319541
H  -2.974515 3.884829 -1.598234
H  -2.637926 4.154773 0.140323
H  -2.374082 5.476865 -1.036302
