program: Gaussian 09
title: 000270089
version: EM64L-G09RevD.01
frameworkgroup: C1[X(C15H23O5P)]
method: RPBEPBE
basis: SDD
operation: Freq
keyword: #p
keyword: freq=noraman
keyword: PBEPBE/SDD
title: #p freq=noraman PBEPBE/SDD
converged: YES YES NO NO
title: Mulliken charges:
elementType: P O O O O O C C C C C C C C C C C C C C C H H H H H H H H H H H H H H H H H H H H H H H
charge: 1.290413 -0.527985 -0.522051 -0.635447 -0.260513 -0.238686 -0.602956 -0.530818 0.479356 0.322176 -0.403973 -0.430972 -0.208315 -0.224346 -0.236912 -0.227955 -0.257166 -0.660305 -0.660588 -0.243038 -0.663082 0.317155 0.260077 0.234415 0.309274 0.225274 0.230895 0.218571 0.249725 0.229871 0.227068 0.223099 0.241668 0.225336 0.208834 0.230548 0.228623 0.208694 0.228482 0.222916 0.225287 0.249562 0.227863 0.219926
chargesum: 0.00000
title: Mulliken charges with hydrogens summed into heavy atoms:
elementType: P O O O O O C C C C C C C C C C C C C C C
charge: 1.290413 -0.527985 -0.522051 -0.635447 -0.260513 -0.238686 -0.285801 -0.036327 0.479356 0.322176 -0.094699 -0.205697 0.241152 0.255250 -0.009844 -0.004857 0.209838 0.007700 -0.000496 -0.017751 0.034269
polarizability: 2.35332882e+02 -8.76032851e-01 1.76678346e+02 1.65657961e-01 -3.07958878e+00 1.85235615e+02
1716.lowfreq: -23.1095 -9.4041 -7.2116 0.0004 0.0013 0.0020 5.3341 7.6737 24.1339
frequency: -21.1269 4.7516 21.6963 32.1762 40.3226 43.7131 47.3504 67.4741 77.6108 90.5329 96.7695 99.4471 131.4707 145.2326 150.3430 174.0590 194.3239 204.8004 226.1051 236.0202 241.6511 249.2745 279.9544 292.5244 301.6025 323.1392 343.1516 404.1734 406.6472 426.6664 451.9618 478.8237 501.1130 569.0724 608.5325 619.6902 638.5843 682.7709 697.7584 707.6154 731.7548 750.6419 772.0298 806.6943 808.0974 814.2820 829.3716 863.7709 873.3165 878.8889 891.3413 927.0457 963.4162 985.2407 988.5889 998.3981 1014.1812 1015.1490 1019.9048 1028.8028 1029.8712 1034.1140 1090.5780 1096.1869 1103.1392 1107.2877 1132.5482 1134.9409 1139.6351 1158.2844 1171.9495 1183.8196 1188.6066 1204.3747 1224.8674 1250.4607 1252.4531 1274.3360 1279.1691 1332.8019 1348.7250 1353.1096 1358.6838 1359.9236 1382.7569 1391.4362 1393.3762 1393.5110 1442.1202 1457.2972 1458.9130 1459.0747 1463.5756 1464.8825 1477.9657 1479.8629 1484.7548 1488.5789 1489.5271 1498.1096 1592.1814 1615.2832 1626.4123 2986.8519 2990.7182 2994.0950 2994.1911 3000.1149 3008.1777 3034.4604 3035.4560 3049.3626 3062.5749 3071.7640 3087.5315 3089.4548 3090.6259 3096.4368 3106.1401 3106.7503 3112.5413 3114.0542 3122.9978 3127.8917 3141.7209 3159.2957
redmass: 2.6047 2.5626 3.8163 4.2741 3.0079 3.4975 2.8758 4.0018 3.3834 4.3070 4.0637 2.9105 4.3135 4.3574 5.0490 5.0443 4.8446 1.6684 3.5028 1.2738 1.3322 2.8773 3.6958 3.7725 2.4990 3.2684 4.0472 3.5817 2.8849 4.3200 5.1274 4.6897 5.6119 4.6719 5.5844 6.0739 5.3130 4.6024 5.2473 2.2710 2.6315 2.7722 2.2294 1.0855 1.0872 1.4438 3.6307 1.2673 3.7375 2.9063 3.2863 1.4884 2.3139 1.4107 4.6928 3.3794 3.3878 1.4505 2.9304 3.0917 3.0957 2.5883 1.6597 2.1690 2.2109 2.2009 2.4504 1.4280 1.4467 1.6710 1.0584 1.5715 1.2133 1.1443 1.6612 1.1518 1.1365 1.5106 1.2237 1.4559 1.2634 1.2633 1.3206 1.2725 6.3149 1.2562 1.2340 1.2478 2.0121 1.0413 1.0941 1.0409 1.0489 1.1378 1.0500 1.0468 1.0528 2.1759 1.0872 1.0853 5.8552 5.8089 9.5791 1.0539 1.0356 1.0376 1.0367 1.0619 1.0584 1.0764 1.0662 1.1081 1.0997 1.1061 1.0979 1.0974 1.0983 1.1030 1.1032 1.1022 1.0884 1.0892 1.1069 1.0904 1.0953 1.1013
irintensity: 0.0267 0.0638 0.1800 0.3278 2.0857 0.2949 1.5467 0.6562 0.8501 1.7388 3.4325 2.5249 1.5471 1.4857 7.6226 2.8586 9.3050 1.7408 12.1202 1.4775 2.3025 0.7778 17.7326 7.0203 1.2043 26.3951 5.8742 1.5469 0.4724 24.6503 14.7724 22.2356 39.5474 15.4346 9.9070 5.0243 36.8456 72.4960 38.1324 44.3162 18.6300 33.2095 49.9876 2.8146 4.8885 5.5524 6.1005 2.0776 171.9601 102.1338 110.4666 2.1290 24.8260 1.2379 4.7531 24.5143 63.4878 10.4850 119.9048 184.1190 46.7507 20.5856 24.8079 20.9913 10.3626 8.4704 181.6738 8.1716 8.2476 15.3476 0.6754 11.6817 39.0067 11.8810 1.3549 0.5941 2.7477 36.6772 29.4245 19.6275 2.1846 10.1413 3.3776 7.7744 0.4211 21.7939 29.2442 24.6309 7.5992 11.5711 10.0477 11.2064 17.7882 15.6946 5.5348 4.8027 12.8216 22.9054 8.4899 7.4139 1.2444 7.6364 120.2346 30.5847 25.0456 34.5747 14.3001 15.2082 22.3362 3.6593 18.2665 13.6490 7.4429 0.8626 29.3808 32.1809 31.4125 2.1088 42.7403 35.0121 10.2087 21.0543 26.1728 6.1056 30.2822 41.0029
temp: 298.150 k
press: 1.00000 atm
elementType: 15 8 8 8 8 8 6 6 6 6 6 6 6 6 6 6 6 6 6 6 6 1 1 1 1 1 1 1 1 1 1 1 1 1 1 1 1 1 1 1 1 1 1 1
symmnumber: 1
zpe: 937408.8 jmol-1
zpe.correction: 0.357040 hartree
zpe.thermalcorrener: 0.380969 hartree
zpe.thermalcorrenthalpy: 0.381913 hartree
zpe.thermalcorrgfe: 0.298923 hartree
zpe.sumelectzpe: -1301.105452 hartree
zpe.sumelectthermal: -1301.081523 hartree
zpe.sumelectthermalent: -1301.080579 hartree
zpe.sumelectthermalfe: -1301.163570 hartree
dipole: -0.0874 2.1088 -2.2158
dipole: 3.0601
quadrupole: -114.6762 -126.2294 -131.7137
quadrupole: -7.7039 3.0444 1.7896
quadrupole: 9.5302 -2.0230 -7.5072 -7.7039 3.0444 1.7896
hfenergy: -1301.4624923 hartree
pointgroup: C01 [X(C15H23O5P1)]
dipole: -0.1588781 1.0239746 -0.6129784 debye
polarizability: 233.4461887|-1.4972774|178.7402323|-9.7595041|-4.5858931|185.0604208 unknown
InChI: InChI=1S/C15H23O5P/c1-4-18-15(16)14(12-13-10-8-7-9-11-13)21(17,19-5-2)20-6-3/h7-11,14H,4-6,12H2,1-3H3
charge 0 multiplicity 1
44 atoms
P  1.742354 -0.43426 -0.358648
O  2.376088 -0.910826 -1.901514
O  2.758002 0.918686 0.024837
O  1.71545 -1.582821 0.750328
O  -1.455901 2.029864 -0.731741
O  -0.100571 1.511938 1.09596
C  0.133388 0.285798 -1.043767
C  -0.908456 -0.80796 -1.470578
C  -1.899157 -1.254493 -0.397713
C  -0.448384 1.321688 -0.092445
C  -1.479191 -1.906212 0.792192
C  -3.285615 -1.033143 -0.602657
C  3.655761 -1.674082 -1.935092
C  3.094867 1.175461 1.46206
C  -2.431997 -2.327373 1.746777
C  -4.238495 -1.458533 0.350985
C  -2.180778 3.054295 0.091654
C  3.875938 -2.084344 -3.388467
C  4.238134 2.185821 1.454509
C  -3.812884 -2.109492 1.531413
C  -1.445521 4.395594 0.049986
H  0.475519 0.802919 -1.959299
H  -0.340456 -1.671492 -1.866716
H  -1.472108 -0.38292 -2.31958
H  -0.410608 -2.075412 0.974718
H  -3.619955 -0.524891 -1.515884
H  3.568827 -2.551593 -1.266505
H  4.467288 -1.017173 -1.567756
H  2.189132 1.565493 1.958636
H  3.383413 0.220046 1.938087
H  -2.092714 -2.827601 2.661031
H  -5.305859 -1.283846 0.172656
H  -2.26925 2.669049 1.122088
H  -3.173267 3.105618 -0.383035
H  4.820237 -2.652138 -3.481496
H  3.935932 -1.195241 -4.038974
H  3.047929 -2.722042 -3.742211
H  4.526007 2.431071 2.493995
H  3.933081 3.117578 0.948118
H  5.121352 1.778175 0.933192
H  -4.547445 -2.44226 2.273751
H  -0.456121 4.315788 0.530444
H  -1.312647 4.742054 -0.989314
H  -2.033317 5.156909 0.595674
