program: Gaussian 09
title: 000277267
version: EM64L-G09RevD.01
frameworkgroup: C1[X(C14H19NO)]
method: RPBEPBE
basis: SDD
operation: Freq
keyword: #p
keyword: freq=noraman
keyword: PBEPBE/SDD
title: #p freq=noraman PBEPBE/SDD
converged: NO YES NO NO
title: Mulliken charges:
elementType: O N C C C C C C C C C C C C C C H H H H H H H H H H H H H H H H H H H
charge: -0.419877 -0.059102 -0.178510 -0.133524 -0.179059 -0.294442 -0.521084 -0.456785 -0.443570 -0.646477 0.593666 -0.477473 -0.391688 -0.223121 -0.250666 -0.245843 0.255351 0.230767 0.249414 0.219689 0.230385 0.224831 0.238762 0.173580 0.195715 0.231205 0.230144 0.228116 0.184597 0.319351 0.224991 0.219509 0.222772 0.221811 0.226563
chargesum: 0.00000
title: Mulliken charges with hydrogens summed into heavy atoms:
elementType: O N C C C C C C C C C C C C C C
charge: -0.100526 -0.059102 0.076841 0.097243 0.070355 -0.074753 -0.065868 -0.044443 -0.016649 -0.003619 0.593666 -0.252482 -0.172179 -0.000349 -0.028855 -0.019280
polarizability: 1.87824330e+02 8.75633837e-01 1.48528264e+02 1.80420274e+00 9.52475524e+00 1.14010050e+02
1716.lowfreq: -25.1714 -12.4182 -0.0001 0.0004 0.0007 5.2134 38.2280 53.4263 81.1562
frequency: 37.7004 53.2454 80.9076 140.3041 171.3090 199.2373 207.6892 223.2779 234.8817 261.4192 284.7171 293.7790 377.0395 392.3819 405.1102 447.6878 466.3884 475.2319 527.1537 545.2358 585.8512 616.8453 669.1419 705.2558 732.5401 759.2925 775.9363 793.8369 827.2144 849.3117 860.7266 876.9548 909.3649 915.5080 955.2675 965.4817 971.6987 988.5196 991.4675 991.9402 996.1814 1025.5556 1027.9841 1049.2335 1060.6887 1083.0071 1108.8844 1114.0073 1139.8659 1155.5653 1165.9790 1171.2816 1182.8569 1188.6170 1204.0867 1214.9141 1216.0494 1241.8090 1257.3178 1267.2214 1275.9501 1292.8488 1300.5449 1310.7747 1328.4907 1332.3360 1337.7801 1354.8876 1366.4643 1386.0115 1427.6043 1441.6106 1456.5175 1464.9635 1476.2529 1482.2365 1483.8892 1492.5907 1593.4982 1613.7746 2873.0939 2952.0836 2985.1936 2993.3873 3010.9927 3012.0921 3022.7450 3030.1975 3039.1240 3042.6589 3063.9990 3069.0431 3087.3568 3109.7176 3111.6379 3129.2804 3140.9519 3160.6561 3540.9098
redmass: 3.8988 3.6941 4.3485 3.3794 3.1980 2.1230 1.2399 2.3168 2.2676 1.5277 3.4461 2.6684 2.0539 4.1414 2.8104 4.2124 3.8204 3.2850 3.2752 3.5121 5.1015 6.4042 3.5522 1.6752 4.3197 2.0691 1.8296 2.4499 2.5311 1.2532 2.4158 2.3159 3.4304 1.5305 2.6872 2.2739 1.3972 2.7370 3.2014 1.4670 2.7518 2.2309 2.0632 1.9149 1.9767 1.6037 2.2888 1.3891 1.3927 1.3485 1.7086 1.0600 1.7287 1.1131 1.5185 1.8507 1.5803 1.6554 1.4823 1.4736 1.5179 1.3272 1.5916 1.5051 1.5627 1.3164 1.2982 1.4490 1.1859 5.4728 1.1395 2.1268 1.0731 1.0804 1.1359 1.3405 1.5374 1.0562 5.9736 6.1984 1.0554 1.0823 1.0611 1.0644 1.0732 1.0718 1.0786 1.0866 1.0928 1.0944 1.0990 1.1003 1.1022 1.0870 1.0869 1.0900 1.0955 1.1014 1.0655
irintensity: 0.3399 0.0431 0.5778 2.1493 5.0099 0.5668 0.1640 7.6331 9.0292 101.2461 26.2188 2.0907 0.4019 9.5906 0.0368 0.8567 14.1328 13.9919 13.0888 10.5149 2.1911 0.3999 2.5792 49.7346 6.1718 41.9801 1.9246 3.8449 3.0083 0.1113 1.2270 12.8925 11.1589 1.6124 14.8644 30.5430 0.5617 4.1451 5.5036 0.0839 33.1464 4.1008 9.0908 28.1255 8.4549 9.2428 2.4026 2.9068 26.3429 12.4997 3.3602 0.1342 2.0601 0.0812 4.2053 18.8439 1.4956 13.9135 6.7188 8.3074 17.3058 1.9256 3.5435 4.2858 9.7272 4.8065 0.3812 0.5973 17.9042 0.3607 9.5567 7.9473 10.1263 5.8232 10.4436 25.9966 15.8976 2.9932 1.6682 10.1231 107.4383 17.8938 22.8822 41.3671 61.8067 46.6660 81.4505 15.1563 1.4652 54.6367 5.1075 28.3086 71.5846 14.3788 11.1588 9.6011 45.4757 26.6360 3.5232
temp: 298.150 k
press: 1.00000 atm
elementType: 8 7 6 6 6 6 6 6 6 6 6 6 6 6 6 6 1 1 1 1 1 1 1 1 1 1 1 1 1 1 1 1 1 1 1
symmnumber: 1
zpe: 789727.4 jmol-1
zpe.correction: 0.300791 hartree
zpe.thermalcorrener: 0.315052 hartree
zpe.thermalcorrenthalpy: 0.315996 hartree
zpe.thermalcorrgfe: 0.259915 hartree
zpe.sumelectzpe: -673.632252 hartree
zpe.sumelectthermal: -673.617991 hartree
zpe.sumelectthermalent: -673.617047 hartree
zpe.sumelectthermalfe: -673.673128 hartree
dipole: -0.5469 -0.0474 -1.8493
dipole: 1.9290
quadrupole: -95.6269 -86.6368 -103.4797
quadrupole: 1.1027 -0.7049 4.2548
quadrupole: -0.3791 8.6110 -8.2319 1.1027 -0.7049 4.2548
hfenergy: -673.9330432 hartree
pointgroup: C01 [X(C14H19N1O1)]
dipole: -0.2182964 -0.3768729 -0.621532 debye
polarizability: 187.85816|0.9201538|148.0477337|1.4616532|-10.2778326|114.4567501 unknown
InChI: InChI=1S/C14H19NO/c1-15-11-7-8-13(15)14(16)12(9-11)10-5-3-2-4-6-10/h2-6,11-14,16H,7-9H2,1H3
charge 0 multiplicity 1
35 atoms
O  -0.2966 -0.110764 2.415783
N  -2.73462 0.835853 -0.369742
C  -2.288881 0.274885 0.938305
C  -2.2542 -0.188127 -1.345819
C  -0.734246 0.325771 1.078075
C  -0.032026 -0.487008 -0.054197
C  -0.701007 -0.199894 -1.439786
C  -2.830211 -1.181494 0.835728
C  -2.810273 -1.492492 -0.702989
C  -2.471695 2.253206 -0.653865
C  1.477767 -0.257761 -0.090697
C  2.379886 -1.323695 0.148101
C  2.015568 1.025576 -0.374361
C  3.77849 -1.121067 0.106522
C  3.410603 1.235613 -0.415176
C  4.299856 0.161439 -0.175993
H  -2.733439 0.835003 1.78086
H  -2.689619 0.008851 -2.343082
H  -0.406011 1.379809 1.047467
H  -0.19915 -1.560977 0.176786
H  -0.351086 0.776381 -1.827636
H  -0.363571 -0.962284 -2.168599
H  -3.857671 -1.22417 1.232375
H  -2.225775 -1.902842 1.419756
H  -2.187214 -2.370272 -0.952812
H  -3.831515 -1.687441 -1.070191
H  -2.924336 2.870235 0.143524
H  -2.959292 2.525804 -1.607965
H  -1.39586 2.544008 -0.733088
H  -0.521225 -1.070826 2.522514
H  1.982853 -2.321995 0.372364
H  1.342069 1.872535 -0.558941
H  4.458211 -1.959498 0.297202
H  3.806081 2.234869 -0.631154
H  5.38314 0.32387 -0.206767
