program: Gaussian 09
title: 000270084
version: EM64L-G09RevD.01
frameworkgroup: C1[X(C13H11N3O3)]
method: RPBEPBE
basis: SDD
operation: Freq
keyword: #p
keyword: freq=noraman
keyword: PBEPBE/SDD
title: #p freq=noraman PBEPBE/SDD
converged: NO YES NO NO
title: Mulliken charges:
elementType: O O O N N N C C C C C C C C C C C C C H H H H H H H H H H H
charge: -0.441575 -0.252877 -0.215774 -0.195866 -0.089064 -0.424026 0.165755 0.040468 0.375167 -0.383287 0.149537 -0.356730 -0.323865 -0.337674 -0.388699 0.140211 -0.239716 -0.256170 -0.000361 0.238729 0.277895 0.292467 0.297631 0.234233 0.246602 0.248775 0.241503 0.243407 0.358492 0.354813
chargesum: 0.00000
title: Mulliken charges with hydrogens summed into heavy atoms:
elementType: O O O N N N C C C C C C C C C C C C C
charge: -0.086762 -0.252877 -0.215774 -0.195866 -0.089064 -0.065534 0.165755 0.040468 0.375167 0.133337 0.149537 -0.064264 -0.026234 0.143160 -0.139924 0.140211 0.001787 -0.012763 -0.000361
polarizability: 2.98737428e+02 2.54021766e+01 1.94407540e+02 3.34482171e+00 -1.37010454e+01 7.91845608e+01
1716.lowfreq: -7.0837 -2.7897 -0.0009 -0.0008 -0.0005 5.8516 43.4280 58.3373 76.3004
frequency: 43.3703 58.3265 76.2936 99.8739 116.3080 154.7411 177.5895 183.4705 217.5116 273.2566 292.4211 298.4553 320.5149 335.3894 379.1571 403.0636 421.5257 446.4678 488.9795 513.7539 525.4186 544.7226 561.0258 601.7844 624.1634 652.7979 670.3315 714.6409 749.5024 756.1363 766.0817 769.8034 792.1885 812.9323 846.4922 864.6473 870.8207 901.8597 949.2400 970.6420 978.3881 992.6775 996.5085 1018.8651 1037.6098 1066.0911 1081.5904 1154.6252 1163.9792 1177.0955 1188.7289 1226.0219 1238.5282 1274.5467 1290.2472 1325.7392 1337.4316 1346.5052 1348.2611 1357.7523 1383.5812 1400.0513 1405.0815 1441.3399 1450.6267 1460.7769 1489.3526 1515.5541 1562.5063 1603.1528 1619.3659 1626.9595 1649.4769 3012.0057 3038.6703 3089.4213 3107.4004 3138.0926 3144.5623 3147.8956 3172.0855 3190.4766 3517.7336 3577.0203
redmass: 8.9665 5.0232 4.9555 5.4309 3.1625 8.4493 7.1159 5.6513 4.5363 4.9905 1.2381 3.6593 8.4948 5.6526 4.5608 8.2574 3.4681 2.6749 3.6055 6.8943 6.8873 3.4263 3.2041 6.7046 6.4915 3.8665 5.5896 4.6585 3.3222 3.0264 1.7265 2.0148 3.4263 6.2703 4.2374 2.0122 1.9879 2.7841 1.3597 4.2112 1.4726 1.3669 2.6320 3.6806 2.4780 2.3600 2.7747 1.4199 4.1127 1.4876 1.1817 1.5766 1.7861 4.3892 1.8650 1.4160 2.5357 1.5701 1.5808 1.5119 1.4837 2.7699 7.8940 2.5733 1.1993 1.0983 3.2573 5.2361 6.9118 10.1084 6.4130 5.6050 9.4003 1.0611 1.0602 1.1038 1.1041 1.0879 1.0926 1.0909 1.0976 1.0952 1.0770 1.0667
irintensity: 0.0229 2.9295 0.5991 0.7160 5.8952 8.3789 0.8204 3.4797 0.3538 12.9161 169.3191 50.9744 7.2804 4.1044 1.0401 18.6672 1.0027 11.6030 5.3110 7.5828 20.2746 1.3667 3.9282 2.9915 3.7139 12.5056 3.8640 2.2571 29.6413 7.2143 56.1792 1.1006 118.0416 12.8961 11.9163 2.1428 5.7088 25.2903 1.7382 32.3065 18.1345 1.7191 8.7592 55.1776 5.9332 5.0688 22.8763 0.4595 156.6585 27.7931 17.4597 74.8411 41.6965 6.4140 7.4798 3.3936 3.6116 17.4923 8.1565 23.6782 25.3399 46.7207 9.1017 82.7894 16.1204 4.8432 138.6782 259.4816 231.7540 517.4316 18.5591 583.3317 116.3002 23.0278 16.4103 21.1348 7.3340 0.8225 0.4533 8.8666 18.8858 2.8843 61.4839 10.5342
temp: 298.150 k
press: 1.00000 atm
elementType: 8 8 8 7 7 7 6 6 6 6 6 6 6 6 6 6 6 6 6 1 1 1 1 1 1 1 1 1 1 1
symmnumber: 1
zpe: 589699.7 jmol-1
zpe.correction: 0.224605 hartree
zpe.thermalcorrener: 0.239972 hartree
zpe.thermalcorrenthalpy: 0.240916 hartree
zpe.thermalcorrgfe: 0.181821 hartree
zpe.sumelectzpe: -890.610402 hartree
zpe.sumelectthermal: -890.595036 hartree
zpe.sumelectthermalent: -890.594091 hartree
zpe.sumelectthermalfe: -890.653186 hartree
dipole: -7.1524 -1.5288 -0.1686
dipole: 7.3160
quadrupole: -118.4132 -118.6754 -108.7076
quadrupole: 2.8265 2.4795 -1.7199
quadrupole: -3.1478 -3.4099 6.5578 2.8265 2.4795 -1.7199
hfenergy: -890.8350072 hartree
pointgroup: C01 [X(C13H11N3O3)]
dipole: -2.8360207 -0.473421 -0.1325526 debye
polarizability: 300.5573333|21.0196595|191.6096357|8.2384786|-15.850787|80.1625595 unknown
InChI: InChI=1S/C13H11N3O3/c17-6-5-16-10-4-2-1-3-8(10)7-9-11(16)14-13(19)15-12(9)18/h1-4,7,15,17H,5-6H2
charge 0 multiplicity 1
30 atoms
O  -1.876489 3.197413 1.094269
O  2.512121 -2.913948 0.623971
O  4.195693 1.37552 -0.091857
N  -0.45889 0.824535 -0.370378
N  1.863006 1.142326 -0.219834
N  3.312226 -0.745373 0.259997
C  -1.624939 0.040258 -0.246569
C  0.828148 0.295882 -0.138161
C  -1.500252 -1.372337 0.026439
C  -0.523551 2.251274 -0.803099
C  0.930654 -1.126335 0.151958
C  -0.192808 -1.928613 0.219086
C  -2.926749 0.603012 -0.38977
C  -0.599776 3.253413 0.364327
C  -2.675033 -2.177836 0.115242
C  2.290195 -1.694691 0.366322
C  -4.060951 -0.220387 -0.299892
C  -3.945874 -1.617691 -0.054918
C  3.162754 0.658525 -0.027638
H  -1.381959 2.374693 -1.481856
H  0.410695 2.451342 -1.354036
H  -0.061112 -2.995881 0.432024
H  -3.055128 1.678606 -0.522205
H  -0.557683 4.272505 -0.055249
H  0.268715 3.113047 1.034684
H  -2.558128 -3.247563 0.322284
H  -5.052756 0.231459 -0.408564
H  -4.842989 -2.240366 0.011152
H  4.27525 -1.070532 0.395879
H  -1.851692 2.463047 1.75729
