program: Gaussian 09
title: 000270083
version: EM64L-G09RevD.01
frameworkgroup: C1[X(C13H19NO6)]
method: RPBEPBE
basis: SDD
operation: Freq
keyword: #p
keyword: freq=noraman
keyword: PBEPBE/SDD
title: #p freq=noraman PBEPBE/SDD
converged: NO YES NO NO
title: Mulliken charges:
elementType: O O O O O O N C C C C C C C C C C C C C H H H H H H H H H H H H H H H H H H H
charge: -0.503994 -0.425249 -0.464737 -0.441460 -0.282885 -0.328939 -0.424234 -0.155795 -0.070889 -0.137630 -0.490385 -0.326296 0.342610 0.049468 -0.436251 -0.308353 -0.223881 -0.260564 0.202993 -0.496607 0.215708 0.256089 0.269404 0.233400 0.259552 0.203443 0.192868 0.353294 0.391848 0.335165 0.371111 0.276396 0.354301 0.274439 0.235215 0.237412 0.245107 0.242326 0.235999
chargesum: 0.00000
title: Mulliken charges with hydrogens summed into heavy atoms:
elementType: O O O O O O N C C C C C C C C C C C C C
charge: -0.112146 -0.090083 -0.093626 -0.087159 -0.282885 -0.328939 -0.070939 0.059913 0.185200 0.131773 0.002567 0.070016 0.342610 0.049468 -0.159855 -0.033914 0.011334 -0.023152 0.202993 0.226826
polarizability: 1.92541639e+02 9.09861366e+00 1.91047327e+02 3.53443018e+01 -9.09458600e+00 1.44479561e+02
1716.lowfreq: -3.9143 -0.0006 -0.0005 -0.0002 1.7509 7.8564 16.7146 31.9273 47.0126
frequency: 16.4456 31.8068 46.9770 58.9480 73.5351 79.1491 93.9294 96.5096 127.7198 138.9656 156.9109 159.1593 190.6178 213.6157 222.5658 273.7849 281.1799 301.8108 315.7569 329.7909 366.5728 386.9674 389.5212 402.4583 427.8366 452.8750 467.2156 490.7704 505.4133 520.0854 526.6025 576.0497 606.9102 617.7890 648.8992 682.2937 717.1006 748.7820 761.1478 772.3261 791.1849 803.4959 824.4178 854.4018 865.8831 897.8280 920.5968 932.9555 968.7272 981.6288 988.8241 1019.1339 1019.8745 1040.2123 1045.5544 1058.4929 1064.9871 1086.7920 1112.3178 1114.0475 1146.9405 1149.4188 1159.2218 1177.0810 1182.1998 1206.0696 1234.1329 1248.3909 1258.0036 1270.8670 1275.5772 1288.8779 1329.6079 1340.4493 1350.0693 1354.1161 1359.9241 1371.5176 1380.7781 1384.5186 1392.6908 1423.4223 1439.8990 1446.2932 1451.9905 1463.6766 1467.7820 1468.6593 1519.6194 1565.0065 1602.9731 1627.3945 2941.8762 2971.2955 3005.7132 3024.5829 3049.7632 3063.1968 3075.4171 3096.9754 3108.1688 3131.6104 3150.5130 3154.1951 3163.0564 3181.3584 3311.4869 3465.4203 3481.0543 3483.1761 3506.4071
redmass: 5.8479 5.2460 4.8243 5.9951 4.1684 5.5209 3.6885 1.3665 3.1706 4.3692 3.9980 3.8058 5.4850 5.7802 5.8930 4.3334 4.3933 4.5343 5.0005 4.4175 2.6535 1.3364 5.8365 1.6029 2.5217 2.1801 3.2545 1.2754 2.5564 3.4732 3.3853 4.0180 1.2042 3.4641 5.9763 5.4274 3.3220 2.9554 3.5280 1.5072 3.4311 1.6421 3.0337 3.6400 1.3909 2.8366 7.3509 2.7160 1.3545 4.1545 1.3257 3.1078 2.4238 2.3281 5.4253 2.8813 2.8016 2.3124 2.2294 1.2693 1.4008 1.4797 1.3993 1.0922 1.1598 1.4297 1.9235 1.3435 1.2713 1.4652 1.9333 1.3168 1.3590 1.6225 1.3056 1.4483 1.2273 1.2740 2.6040 1.6107 1.3043 1.5465 1.9397 2.2448 1.0504 1.0595 1.1084 1.1225 3.5299 6.5072 2.2137 5.6764 1.0672 1.0845 1.0295 1.0640 1.0926 1.0868 1.0890 1.0993 1.1047 1.0865 1.1049 1.0899 1.0935 1.0986 1.0798 1.0645 1.0652 1.0676 1.0660
irintensity: 0.3569 0.2691 2.9449 1.2681 0.7578 1.1285 0.8523 1.6091 2.5392 4.8962 12.6186 2.1973 6.2809 0.0491 2.2738 4.2428 6.9529 25.0208 11.5146 19.7250 5.7366 0.9687 2.7993 110.1186 129.0990 141.1093 1.3501 51.0956 5.8650 4.4781 4.7532 12.3522 239.9677 32.2078 7.2848 3.8845 31.2715 7.4822 23.5212 90.2752 21.6222 57.9309 30.9714 20.5495 1.2288 37.5329 1.8830 11.0503 3.4334 46.4658 0.7778 117.2278 62.8743 5.0388 27.2173 68.9970 59.7647 16.9939 23.5872 0.1349 12.9509 139.4135 24.0590 8.3252 8.2369 22.3032 241.8899 20.3157 2.9265 138.9647 142.5010 9.5666 39.8317 15.0560 5.2295 17.8862 14.7272 25.1352 44.2526 65.4762 14.9472 63.0032 22.6628 27.7496 14.8002 8.0830 6.1871 10.8644 190.1215 75.7572 158.4238 196.3708 56.0975 28.7101 40.3855 30.3579 19.6491 24.5026 17.5179 13.2228 24.8929 6.1868 15.2441 12.4297 8.1397 10.2935 126.0421 41.5577 65.2662 110.3417 6.1945
temp: 298.150 k
press: 1.00000 atm
elementType: 8 8 8 8 8 8 7 6 6 6 6 6 6 6 6 6 6 6 6 6 1 1 1 1 1 1 1 1 1 1 1 1 1 1 1 1 1 1 1
symmnumber: 1
zpe: 821658.6 jmol-1
zpe.correction: 0.312953 hartree
zpe.thermalcorrener: 0.333902 hartree
zpe.thermalcorrenthalpy: 0.334846 hartree
zpe.thermalcorrgfe: 0.261764 hartree
zpe.sumelectzpe: -1011.314930 hartree
zpe.sumelectthermal: -1011.293981 hartree
zpe.sumelectthermalent: -1011.293037 hartree
zpe.sumelectthermalfe: -1011.366119 hartree
dipole: -6.0296 2.3818 0.2558
dipole: 6.4881
quadrupole: -135.4449 -110.9374 -124.0362
quadrupole: 15.1264 13.7257 2.5663
quadrupole: -11.9721 12.5355 -0.5634 15.1264 13.7257 2.5663
hfenergy: -1011.6278837 hartree
pointgroup: C01 [X(C13H19N1O6)]
dipole: 2.5235703 0.3686412 0.1072578 debye
polarizability: 187.2736293|-23.5040409|185.6045141|30.0451682|19.497848|155.1903845 unknown
InChI: InChI=1S/C13H19NO6/c1-20-13(19)8-4-2-3-5-9(8)14-6-10(16)12(18)11(17)7-15/h2-5,10-12,14-18H,6-7H2,1H3
charge 0 multiplicity 1
39 atoms
O  -1.837415 1.597199 0.632302
O  -2.098949 -0.83823 -2.238748
O  -4.400982 1.160498 0.260193
O  -5.078261 -0.836212 2.07638
O  3.260916 -2.454785 0.033967
O  1.698322 -1.978622 -1.61553
N  0.560504 0.432426 -1.58087
C  -2.106298 0.322072 -0.068263
C  -1.94829 0.484215 -1.601715
C  -3.556056 -0.052491 0.309267
C  -0.625785 1.163646 -2.042533
C  -3.670726 -0.676052 1.714096
C  1.322836 0.710795 -0.460688
C  2.254833 -0.277801 0.052603
C  1.243606 1.970116 0.225176
C  3.046477 0.025169 1.195873
C  2.045029 2.23408 1.349467
C  2.948627 1.261839 1.852595
C  2.358512 -1.59885 -0.591465
C  3.400452 -3.7986 -0.57468
H  -1.409657 -0.467622 0.287086
H  -2.797283 1.071157 -1.993967
H  -3.978356 -0.735608 -0.446422
H  -0.613022 2.208509 -1.695477
H  -0.618919 1.180198 -3.14755
H  -3.230418 -1.689113 1.728537
H  -3.137732 -0.036739 2.452535
H  0.779817 -0.475628 -2.023911
H  -0.889171 1.641354 0.92446
H  -1.344174 -1.421693 -1.958458
H  -3.847617 1.888668 0.658858
H  0.622957 2.772819 -0.184845
H  -5.535993 -0.017927 1.739461
H  3.736659 -0.743009 1.555247
H  1.972634 3.214833 1.833908
H  3.564236 1.476186 2.730877
H  3.721697 -3.711603 -1.62604
H  2.439898 -4.338966 -0.533324
H  4.16429 -4.300824 0.034994
