program: Gaussian 09
title: 000270081
version: EM64L-G09RevD.01
frameworkgroup: C1[X(C15H21NO6)]
method: RPBEPBE
basis: SDD
operation: Freq
keyword: #p
keyword: freq=noraman
keyword: PBEPBE/SDD
title: #p freq=noraman PBEPBE/SDD
converged: YES YES NO NO
title: Mulliken charges:
elementType: O O O O O O N C C C C C C C C C C C C C C C H H H H H H H H H H H H H H H H H H H H H
charge: -0.248319 -0.458349 -0.433785 -0.451726 -0.281579 -0.339857 -0.425120 -0.131603 -0.253566 -0.077568 -0.163333 -0.323418 0.354891 0.054672 -0.579525 0.388887 0.375318 -0.553663 0.200284 -0.815850 -0.819727 -0.496586 0.220533 0.269383 0.247743 0.250135 0.186615 0.229148 0.345635 0.366314 0.354468 0.264263 0.367254 0.274534 0.237959 0.229196 0.231383 0.225080 0.235009 0.225668 0.241575 0.234335 0.243292
chargesum: 0.00000
title: Mulliken charges with hydrogens summed into heavy atoms:
elementType: O O O O O O N C C C C C C C C C C C C C C C
charge: -0.248319 -0.092035 -0.079317 -0.084472 -0.281579 -0.339857 -0.079486 0.088930 0.015817 0.170175 0.086802 0.092345 0.354891 0.054672 -0.315263 0.388887 0.375318 -0.279129 0.200284 -0.117311 -0.133970 0.222616
polarizability: 2.60438795e+02 -1.20452984e+01 2.24764470e+02 1.10256503e+01 3.68411544e+00 1.30479726e+02
1716.lowfreq: -0.0009 -0.0004 -0.0001 1.6634 4.0771 8.6250 17.7887 22.4706 46.8324
frequency: 17.7231 22.4046 46.8257 61.2648 67.0653 81.3277 93.9673 103.2062 105.0483 111.6931 127.5193 140.7963 153.7415 176.5345 180.6944 200.1062 219.7679 243.0789 254.5023 288.3460 305.6790 313.8995 325.2458 338.0364 354.8740 370.9057 380.5352 402.1321 425.6648 437.5623 451.9863 471.1355 491.9925 504.1888 537.1915 578.5758 588.1261 609.0019 617.5292 683.0133 694.2096 728.8143 733.3495 760.7507 770.4626 834.3206 842.2754 874.1175 880.7978 901.4159 915.9885 918.3966 936.3294 971.8837 1000.3807 1011.0741 1021.7483 1032.6057 1033.6501 1052.0676 1054.3840 1077.7614 1095.5786 1113.3174 1119.0619 1135.3248 1147.4594 1150.0610 1161.1755 1220.3505 1223.3510 1231.5295 1239.6631 1249.2843 1255.9557 1270.6083 1286.3141 1302.3503 1317.2016 1331.9653 1344.7856 1364.1046 1378.9220 1386.7981 1390.2088 1394.4239 1404.1525 1406.0772 1410.6155 1431.0076 1451.6545 1459.5718 1460.2804 1464.7173 1473.1210 1474.0205 1480.0024 1484.4649 1514.2966 1563.5099 1598.0977 1644.1429 2946.0731 2960.3151 2968.4396 2973.9940 3005.7393 3008.2176 3039.2294 3047.3917 3061.4612 3076.2716 3082.3719 3084.3803 3091.4639 3108.0005 3149.2876 3153.7624 3161.3563 3283.2168 3483.4568 3513.0977 3551.2778
redmass: 5.6100 5.7325 5.7043 4.4146 3.5095 2.1791 3.1124 1.0957 3.0524 2.4795 3.8176 3.7924 1.3519 3.3521 2.6307 3.5379 4.0745 3.7890 2.7254 2.6642 3.1380 3.4515 2.5302 3.4076 5.5682 1.6164 1.9681 5.1899 4.5785 1.1784 3.0920 3.2582 3.8264 4.6891 4.6878 4.7541 4.7204 4.3783 4.9750 5.0362 4.4512 1.4646 5.6230 3.9861 3.2360 5.1651 3.9616 1.5684 1.9204 2.9036 4.8490 1.4284 6.4349 6.2358 1.5043 1.7730 2.1274 1.7021 3.1671 4.3522 1.6574 2.2989 3.4420 1.2591 3.0245 2.4625 1.4925 1.9587 1.9099 1.9251 1.3183 1.4722 1.8211 1.5062 1.1853 1.3446 1.3452 1.3001 4.1097 1.3491 1.3051 1.4252 1.4859 2.0972 1.2472 1.3016 1.5247 1.4484 2.4494 1.3374 1.0506 1.3885 1.1196 1.1435 1.3130 1.0637 1.4301 1.0928 2.9278 7.2100 2.2280 5.6030 1.0835 1.0694 1.0380 1.0381 1.0295 1.0840 1.0970 1.0964 1.0865 1.0883 1.0963 1.0979 1.0984 1.1046 1.1048 1.0909 1.0916 1.0802 1.0672 1.0657 1.0659
irintensity: 0.5358 0.7074 0.3197 0.5058 1.4508 0.5304 3.3074 0.0360 4.7696 0.5483 3.7440 3.5346 0.0643 1.4407 3.2990 9.4683 7.6541 5.2208 21.6911 1.8014 13.2919 5.5144 37.3864 5.3831 1.0899 3.7070 39.1763 12.5325 32.3389 244.6724 8.7733 15.8831 8.6953 16.4619 21.0293 2.9453 9.5690 4.0502 18.4836 7.5586 3.3208 56.4068 7.5636 3.0859 33.2361 138.9516 10.9538 49.1442 12.3195 27.1178 5.5608 4.9137 294.2364 98.5728 40.9280 30.2610 27.0875 32.8038 31.8243 53.0358 0.7764 29.9118 64.7934 0.0626 114.6168 72.8682 45.8052 94.8983 11.0239 11.6417 17.8895 73.2825 179.3735 78.8213 26.1432 24.5241 30.2771 14.7578 256.7174 15.0756 8.6172 14.7126 57.6694 8.1053 35.4391 4.7308 29.2028 8.0765 18.1268 45.5825 14.1845 44.8772 11.2468 22.6656 44.0696 31.0179 6.1606 3.4714 314.0609 205.6017 171.1526 189.4524 24.6053 56.9177 52.7739 23.7190 44.9876 56.7084 28.6069 10.6520 13.4994 29.6739 31.3650 25.2205 13.5375 25.4292 17.0209 10.2930 1.6467 113.9243 32.6778 40.4660 14.5892
temp: 298.150 k
press: 1.00000 atm
elementType: 8 8 8 8 8 8 7 6 6 6 6 6 6 6 6 6 6 6 6 6 6 6 1 1 1 1 1 1 1 1 1 1 1 1 1 1 1 1 1 1 1 1 1
symmnumber: 1
zpe: 906219.1 jmol-1
zpe.correction: 0.345161 hartree
zpe.thermalcorrener: 0.368675 hartree
zpe.thermalcorrenthalpy: 0.369619 hartree
zpe.thermalcorrgfe: 0.290946 hartree
zpe.sumelectzpe: -1088.593635 hartree
zpe.sumelectthermal: -1088.570121 hartree
zpe.sumelectthermalent: -1088.569177 hartree
zpe.sumelectthermalfe: -1088.647849 hartree
dipole: 5.0783 1.3628 -1.5889
dipole: 5.4928
quadrupole: -135.7377 -112.8646 -141.4031
quadrupole: -6.5481 12.5245 5.8182
quadrupole: -5.7359 17.1372 -11.4013 -6.5481 12.5245 5.8182
hfenergy: -1088.9387959 hartree
pointgroup: C01 [X(C15H21N1O6)]
dipole: 1.9899168 -0.0919162 0.8377923 debye
polarizability: 260.2055418|8.9215119|208.768573|-11.4170837|-36.7302583|146.7088759 unknown
InChI: InChI=1S/C15H21NO6/c1-7-4-9(15(20)21-3)10(5-8(7)2)16-14-13(19)12(18)11(6-17)22-14/h4-5,11-14,16-19H,6H2,1-3H3
charge 0 multiplicity 1
43 atoms
O  -2.174725 1.4384 -0.850905
O  -4.889344 -0.335568 0.836366
O  -2.354807 0.196169 2.677502
O  -4.940078 -0.765338 -2.189938
O  2.584512 -2.594558 1.116743
O  0.315228 -2.117923 1.2155
N  -0.460229 0.328695 0.530686
C  -3.499304 -0.097551 0.452325
C  -2.708285 0.819019 1.41109
C  -3.473523 0.695641 -0.867096
C  -1.533268 1.286575 0.503972
C  -3.592061 -0.184615 -2.11711
C  0.86944 0.590769 0.189936
C  1.87353 -0.423078 0.388996
C  1.2757 1.841506 -0.354117
C  2.620186 2.117738 -0.666731
C  3.627086 1.116245 -0.450763
C  3.227493 -0.128083 0.060539
C  1.502015 -1.73925 0.928308
C  2.995955 3.464706 -1.252645
C  5.082972 1.386651 -0.783423
C  2.258872 -3.938653 1.646697
H  -2.964682 -1.068485 0.343773
H  -3.339629 1.684852 1.674848
H  -4.305295 1.427693 -0.853952
H  -1.157536 2.288869 0.762161
H  -2.810983 -0.974307 -2.09795
H  -3.46526 0.416918 -3.031777
H  -0.648282 -0.673664 0.709524
H  -4.904598 -0.738924 1.742193
H  -1.494326 -0.29274 2.585829
H  0.518087 2.597967 -0.578417
H  -5.258513 -0.965493 -1.268251
H  3.970673 -0.914338 0.222256
H  2.115149 4.117709 -1.366999
H  3.730901 3.989914 -0.612814
H  3.468318 3.351935 -2.24731
H  5.48305 2.243972 -0.208226
H  5.710667 0.50853 -0.556368
H  5.221405 1.63082 -1.854591
H  1.788919 -3.855159 2.640872
H  3.227405 -4.454242 1.708061
H  1.570064 -4.463822 0.964106
