program: Gaussian 09
title: 000270057
version: EM64L-G09RevD.01
frameworkgroup: C1[X(C18H20O5)]
method: RPBEPBE
basis: SDD
operation: Freq
keyword: #pfreq=noraman
keyword: PBEPBE/SDD
title: #p freq=noraman PBEPBE/SDD
converged: NO YES NO NO
title: Mulliken charges:
elementType: O O O O O C C C C C C C C C C C C C C C C C C H H H H H H H H H H H H H H H H H H H H
charge: -0.278352 -0.344817 -0.398544 -0.249859 -0.269777 -0.560650 -0.476586 0.500641 0.223353 0.011576 0.247728 0.222459 -0.381236 -0.437829 -0.554738 -0.547343 0.384243 -0.362841 -0.356650 0.312887 -0.532262 -0.536625 -0.538293 0.229287 0.228141 0.259090 0.258293 0.233869 0.232689 0.253994 0.280655 0.246317 0.236752 0.380485 0.225450 0.225799 0.254213 0.221992 0.252881 0.222098 0.220593 0.217539 0.243379
chargesum: 0.00000
title: Mulliken charges with hydrogens summed into heavy atoms:
elementType: O O O O O C C C C C C C C C C C C C C C C C C
charge: -0.278352 -0.344817 -0.018059 -0.249859 -0.269777 -0.103222 0.040797 0.500641 0.223353 0.011576 0.247728 0.222459 -0.147366 -0.205140 -0.300744 -0.266688 0.384243 -0.116525 -0.119898 0.312887 0.173199 0.160346 0.143219
polarizability: 3.22582475e+02 -8.43379260e+00 2.17011571e+02 -6.16815593e+00 -4.70299739e+00 1.44542193e+02
1716.lowfreq: -2.9174 0.0002 0.0005 0.0009 4.0668 5.4729 16.5303 20.5747 28.9175
frequency: 16.4382 20.3514 28.9001 36.9316 77.9581 81.0460 91.3011 119.2613 123.8991 141.3604 155.8065 168.9225 177.5374 203.3389 219.4452 223.6925 234.0879 236.1413 270.0095 288.4336 306.0141 317.1016 331.3068 370.5786 403.6361 405.4307 415.3695 445.3585 457.9043 510.1067 512.6685 545.9095 552.1121 560.6761 572.6510 602.2002 633.5850 636.6186 668.3521 704.3022 728.0483 730.4690 777.9960 782.4909 799.8584 811.9563 826.2802 851.6716 857.4061 897.7133 925.0702 937.2243 962.6130 981.8610 987.6435 994.8108 1004.2598 1022.9536 1023.5767 1064.7526 1082.9186 1106.6234 1108.9699 1110.4185 1111.9724 1144.0808 1146.7611 1155.3127 1158.8872 1164.4127 1177.9822 1213.1931 1215.2222 1225.5192 1228.2268 1265.7170 1268.1026 1300.8584 1308.7392 1338.4672 1374.0090 1381.3844 1396.7739 1410.5801 1415.8357 1422.5358 1434.4885 1435.3489 1444.7003 1463.6578 1465.0710 1468.2063 1468.4417 1470.5692 1471.1803 1473.3217 1479.2708 1502.6018 1546.7274 1584.4192 1584.8313 1624.3444 1643.9642 2524.1256 2955.3167 2963.6326 2966.5374 2995.0287 3009.1289 3035.4265 3041.2966 3054.4305 3059.3207 3069.8426 3117.6435 3120.5552 3122.3601 3129.2489 3129.6729 3157.8662 3163.2746 3193.1809 3198.0375
redmass: 5.0778 3.6639 5.0146 4.5534 3.7290 3.7205 3.3092 4.8820 4.8792 2.7366 5.1393 3.2680 1.9222 2.5485 2.9621 1.7258 2.0458 1.4805 1.5880 4.0238 4.4725 4.4283 2.7886 5.8661 5.1161 4.7031 3.0409 4.8328 6.1100 7.0204 3.8691 2.8825 2.7608 5.6844 6.3697 3.5111 6.7104 3.0206 4.3190 4.7301 3.4153 2.2491 3.9486 1.7566 1.9569 1.5483 1.6257 2.8224 1.9512 7.4754 5.3993 1.5259 1.3674 5.2776 4.4778 2.4977 2.6484 1.0672 3.0855 3.7526 5.9323 1.3316 1.2855 1.2579 1.2606 1.6399 1.1653 1.3206 1.6324 1.6594 1.2284 1.5455 2.0579 2.6474 2.5788 1.1648 2.9263 1.7433 1.5468 2.7330 2.7317 4.8262 3.0757 1.5817 3.3052 2.0291 1.2913 1.1703 1.3325 1.5637 1.0507 1.0508 1.0963 1.0524 1.0724 1.0735 1.5866 2.4999 4.2948 4.3643 3.6855 6.4948 4.6206 1.0759 1.0331 1.0328 1.0324 1.0625 1.0610 1.0962 1.1037 1.1043 1.1045 1.1016 1.0895 1.0912 1.0967 1.1000 1.0996 1.0937 1.0951 1.0895 1.0930
irintensity: 0.4168 1.3332 0.8476 0.8418 1.8124 2.6073 3.3748 2.3812 0.3281 4.2035 3.7406 0.2250 2.2757 0.7203 2.8779 0.2200 0.9213 0.3978 0.0028 4.2596 0.7306 9.0596 1.3531 6.8193 12.0804 11.7169 2.3354 8.1282 2.2526 3.9678 38.5368 26.3484 0.3467 4.7657 5.8385 0.0813 0.2887 6.4041 27.7813 7.2182 5.1253 14.9674 4.5966 4.6319 8.6276 27.4125 12.5997 27.6899 61.3632 3.4756 20.6341 1.1958 0.5560 46.2162 18.2327 27.1238 8.5105 121.1309 33.3048 15.7894 104.2630 8.0216 3.1965 0.0783 0.2421 71.3041 3.5834 0.9166 157.4927 41.1180 63.9090 142.2339 45.3573 191.1870 98.4779 0.6833 79.6448 119.7887 72.5355 8.8293 91.5638 14.4432 63.6280 12.4275 4.6605 178.0951 25.6951 8.5472 10.1802 17.6829 11.9189 0.3072 15.2145 28.2742 45.1552 60.3190 71.3609 137.8536 182.7149 130.7155 98.0512 32.6173 688.3897 525.2227 72.9393 40.3777 74.8758 13.2979 17.0755 0.5591 52.2237 41.7048 37.4606 17.0116 15.3574 44.5912 5.0591 27.1065 9.4318 18.5454 5.1525 3.6849 0.4892
temp: 298.150 k
press: 1.00000 atm
elementType: 8 8 8 8 8 6 6 6 6 6 6 6 6 6 6 6 6 6 6 6 6 6 6 1 1 1 1 1 1 1 1 1 1 1 1 1 1 1 1 1 1 1 1
symmnumber: 1
zpe: 895021.9 jmol-1
zpe.correction: 0.340896 hartree
zpe.thermalcorrener: 0.363454 hartree
zpe.thermalcorrenthalpy: 0.364398 hartree
zpe.thermalcorrgfe: 0.286879 hartree
zpe.sumelectzpe: -1072.309528 hartree
zpe.sumelectthermal: -1072.286970 hartree
zpe.sumelectthermalent: -1072.286025 hartree
zpe.sumelectthermalfe: -1072.363545 hartree
dipole: 0.4410 -7.7752 -1.4485
dipole: 7.9212
quadrupole: -123.1783 -131.9241 -131.4280
quadrupole: 21.9869 -12.5981 1.3064
quadrupole: 5.6652 -3.0806 -2.5845 21.9869 -12.5981 1.3064
hfenergy: -1072.6504236 hartree
pointgroup: C01 [X(C18H20O5)]
dipole: -0.04116 -3.0903166 -0.400685 debye
polarizability: 320.4418062|-15.8750972|217.8827303|-11.5552281|-7.7632134|145.8117025 unknown
InChI: InChI=1S/C18H20O5/c1-21-13-7-4-12(5-8-13)6-9-15(19)18-16(20)10-14(22-2)11-17(18)23-3/h4-5,7-8,10-11,20H,6,9H2,1-3H3
charge 0 multiplicity 1
43 atoms
O  -1.366064 -1.316485 0.040602
O  -0.807439 2.851814 -0.237104
O  -3.24915 3.166567 -0.221697
O  -6.229151 -0.510223 0.071773
O  6.442725 -1.569506 0.158762
C  1.667434 1.669562 -0.163014
C  0.408346 0.76983 -0.113752
C  2.942403 0.840546 -0.111385
C  -0.893924 1.554553 -0.148768
C  -2.224433 0.935228 -0.089764
C  -2.486636 -0.477602 0.006297
C  -3.393308 1.809213 -0.129193
C  3.421572 0.31482 1.120542
C  3.676112 0.540652 -1.283067
C  -3.795161 -0.995492 0.062284
C  -4.703229 1.293318 -0.073235
C  -4.896957 -0.094541 0.02184
C  4.581397 -0.478566 1.179993
C  4.845803 -0.256056 -1.248359
C  5.297841 -0.768998 -0.008593
C  -1.571892 -2.764887 0.143405
C  -6.510938 -1.945765 0.168984
C  7.223669 -1.883624 -1.038186
H  1.637637 2.283116 -1.080993
H  1.629074 2.383404 0.680362
H  0.4190 0.130284 0.78942
H  0.414349 0.046178 -0.951564
H  2.881942 0.541714 2.048778
H  3.33456 0.940781 -2.245948
H  -3.962147 -2.070778 0.134454
H  -5.554847 1.974881 -0.104233
H  4.95612 -0.8768 2.128155
H  5.387909 -0.459122 -2.177112
H  -2.211614 3.351246 -0.250186
H  -2.132646 -3.151705 -0.728725
H  -2.099203 -3.028245 1.080067
H  -0.558741 -3.192266 0.153879
H  -6.121653 -2.492578 -0.711303
H  -7.607798 -2.017857 0.192943
H  -6.089924 -2.376635 1.097742
H  7.621779 -0.965583 -1.513659
H  6.622429 -2.450106 -1.77664
H  8.057256 -2.507491 -0.683103
