program: Gaussian 09
title: 000270048
version: EM64L-G09RevD.01
frameworkgroup: C1[X(C13H17N3O2)]
method: RPBEPBE
basis: SDD
operation: Freq
keyword: #p
keyword: freq=noraman
keyword: PBEPBE/SDD
title: #p freq=noraman PBEPBE/SDD
converged: YES YES NO NO
title: Mulliken charges:
elementType: O O N N N C C C C C C C C C C C C C H H H H H H H H H H H H H H H H H
charge: -0.219749 -0.229823 -0.442641 -0.070126 -0.355537 -0.099626 -0.512270 0.051484 0.044069 -0.519159 0.244690 -0.417178 -0.499551 -0.396176 -0.525765 -0.522898 0.155145 0.155900 0.262504 0.223690 0.223899 0.215860 0.247657 0.212603 0.210263 0.226741 0.221442 0.211460 0.210799 0.250842 0.256787 0.274643 0.246842 0.316246 0.346933
chargesum: 0.00000
title: Mulliken charges with hydrogens summed into heavy atoms:
elementType: O O N N N C C C C C C C C C C C C C
charge: -0.219749 -0.229823 -0.126395 -0.070126 -0.008605 0.162878 -0.064681 0.051484 0.044069 -0.055643 0.244690 0.005687 -0.051368 0.026083 -0.018136 -0.001413 0.155145 0.155900
polarizability: 1.92392639e+02 1.16148893e+01 1.57893248e+02 1.95490076e+01 -2.96063021e+00 1.18193287e+02
1716.lowfreq: -11.9558 -4.6661 -0.0007 -0.0006 -0.0006 7.9190 21.7811 38.2165 46.6970
frequency: 21.5359 37.7230 46.6103 77.5076 104.1480 110.3404 150.1771 163.7985 214.7120 279.5410 284.3789 291.4308 319.6868 356.1228 402.4208 413.1359 436.4955 462.6900 484.5340 504.1401 515.4596 530.5889 572.5353 589.2112 627.7315 648.3620 662.6866 684.0102 713.6717 778.7267 801.9519 825.1060 825.8277 845.6289 853.1363 871.1335 908.2262 913.5870 922.1358 939.0765 957.0223 970.1940 1025.3694 1075.0017 1078.9339 1086.0045 1091.7012 1114.1445 1135.5814 1144.6538 1149.4146 1165.3372 1204.5099 1221.8996 1238.8090 1242.6107 1252.8779 1273.2813 1275.8170 1300.7563 1314.0474 1318.2271 1327.0356 1333.0990 1339.9199 1350.4595 1352.9539 1355.2011 1370.3324 1385.8310 1437.5708 1443.9451 1448.7690 1460.1646 1463.4287 1469.0169 1469.6673 1476.7726 1494.7473 1583.0479 1633.8007 1640.8883 2961.5124 2961.7799 2982.9251 2984.9667 2985.1740 2986.4756 2991.6625 3015.0780 3023.9157 3027.5948 3047.3428 3051.5385 3054.5125 3074.8385 3080.7819 3480.3163 3611.4497
redmass: 5.4126 5.3798 5.9947 3.8827 6.1228 2.8109 7.2855 3.1895 2.7891 2.2888 2.4117 2.3230 2.3890 7.5692 3.0906 3.9816 3.4351 4.2641 2.6030 4.3783 4.5803 2.6469 2.0819 3.2678 2.4011 2.0293 4.9312 4.1571 3.9294 3.5065 1.3882 2.3861 1.8057 2.3701 2.2003 2.9868 1.5040 2.1293 2.8187 2.7445 2.5486 2.1922 3.1473 2.1680 1.9328 1.8792 1.9580 4.4289 1.1603 1.3435 1.3946 1.5598 2.0441 1.6431 1.3500 1.4750 1.5658 1.8659 1.5022 2.0988 1.7723 1.5968 1.8498 1.3990 1.4440 1.4653 1.6314 1.5507 1.8589 2.2226 1.0813 2.7822 1.1401 1.1740 1.1359 1.0893 1.1703 1.1234 5.0890 5.1020 8.9247 6.1283 1.0615 1.0647 1.0654 1.0628 1.0658 1.0666 1.0610 1.0958 1.0949 1.0874 1.0986 1.1001 1.1043 1.0942 1.0938 1.0759 1.0819
irintensity: 0.6422 2.0777 0.1072 1.1224 3.7568 0.2656 6.6787 0.7391 0.7618 7.1273 2.3791 0.4943 7.9915 14.0484 8.3533 1.4181 3.5563 12.9086 1.8957 1.5279 11.3448 3.4156 41.8286 10.1714 16.0597 32.1415 3.4534 2.2833 0.2158 7.3293 75.6018 37.1611 5.8227 6.7215 5.9804 1.6904 1.4928 1.4486 4.1468 9.4995 10.8578 3.2284 5.3480 3.5106 0.1874 5.6543 6.7430 5.3726 2.6811 106.0356 21.7211 1.5190 4.7478 40.1917 1.7450 1.7639 8.8824 164.7266 18.2903 38.2139 19.8660 2.3374 28.9650 3.8405 10.3533 13.4831 6.6157 6.0382 14.6184 0.3773 10.4262 14.8911 20.5967 5.2728 4.3941 9.3087 8.3201 5.1736 20.1023 14.3262 162.9315 410.0406 58.4888 12.4675 28.3048 17.8636 32.2437 7.9011 20.2246 43.0686 10.6944 8.3784 64.1474 22.6171 57.7314 10.1778 5.0291 33.7372 61.9756
temp: 298.150 k
press: 1.00000 atm
elementType: 8 8 7 7 7 6 6 6 6 6 6 6 6 6 6 6 6 6 1 1 1 1 1 1 1 1 1 1 1 1 1 1 1 1 1
symmnumber: 1
zpe: 759536.8 jmol-1
zpe.correction: 0.289292 hartree
zpe.thermalcorrener: 0.305086 hartree
zpe.thermalcorrenthalpy: 0.306030 hartree
zpe.thermalcorrgfe: 0.244591 hartree
zpe.sumelectzpe: -818.975897 hartree
zpe.sumelectthermal: -818.960103 hartree
zpe.sumelectthermalent: -818.959159 hartree
zpe.sumelectthermalfe: -819.020598 hartree
dipole: 4.1617 -1.3948 1.5757
dipole: 4.6635
quadrupole: -103.6566 -112.0138 -107.3980
quadrupole: 0.6463 -6.8379 -7.4925
quadrupole: 4.0328 -4.3243 0.2914 0.6463 -6.8379 -7.4925
hfenergy: -819.2651893 hartree
pointgroup: C01 [X(C13H17N3O2)]
dipole: -1.6234752 0.5475685 0.6563484 debye
polarizability: 191.2366187|11.6351582|158.0475426|-21.5434547|2.1922517|119.195012 unknown
InChI: InChI=1S/C13H17N3O2/c17-12-6-8(7-13(18)14-12)5-11-9-3-1-2-4-10(9)15-16-11/h8,14-15H,1-7H2
charge 0 multiplicity 1
35 atoms
O  4.64746 -0.047836 -1.496576
O  1.599745 -2.472751 1.005846
N  -2.5847 2.039585 0.391255
N  -1.262075 2.359555 0.091505
N  3.111259 -1.191567 -0.19322
C  1.698764 1.188311 0.415783
C  0.712507 1.125432 -0.791988
C  -1.715629 0.128421 -0.362012
C  -0.736002 1.177724 -0.372643
C  -1.647125 -1.324788 -0.776034
C  -2.894218 0.716367 0.128973
C  -2.887494 -2.092302 -0.23699
C  -4.220028 0.032661 0.324469
C  -4.205768 -1.308303 -0.463677
C  3.170987 1.293913 -0.049653
C  1.547502 -0.032509 1.355744
C  3.714461 0.003713 -0.653218
C  2.054113 -1.328421 0.735887
H  1.444024 2.098591 0.989122
H  0.892561 0.207342 -1.383712
H  0.932446 1.983459 -1.454961
H  -1.615688 -1.404753 -1.882522
H  -0.72531 -1.808957 -0.400649
H  -2.950772 -3.082533 -0.725639
H  -2.758773 -2.276486 0.848419
H  -4.395072 -0.174608 1.400477
H  -5.060142 0.668653 -0.018126
H  -5.071686 -1.923782 -0.155502
H  -4.322755 -1.09739 -1.545111
H  3.821943 1.551582 0.810881
H  3.310937 2.089327 -0.801543
H  0.496198 -0.19147 1.647004
H  2.119643 0.134854 2.291174
H  -3.192432 2.773062 0.749238
H  3.472618 -2.064196 -0.599704
