program: Gaussian 09
title: 000270045
version: EM64L-G09RevD.01
frameworkgroup: C1[X(C20H14O6)]
method: RPBEPBE
basis: SDD
operation: Freq
keyword: #pfreq=noraman
keyword: PBEPBE/SDD
title: #p freq=noraman PBEPBE/SDD
converged: YES YES NO NO
title: Mulliken charges:
elementType: O O O O O O C C C C C C C C C C C C C C C C C C C C H H H H H H H H H H H H H H
charge: -0.216565 -0.259346 -0.262510 -0.210710 -0.261573 -0.259924 -0.233525 -0.660851 -0.027601 0.421265 0.199126 -0.347324 0.171956 0.117091 0.334669 -0.590454 -0.492165 0.179477 0.164423 -0.486573 -0.388512 0.191700 -0.203026 0.162736 -0.346355 -0.206259 0.275679 0.231060 0.239704 0.221456 0.229169 0.265435 0.293784 0.281401 0.258850 0.240929 0.241938 0.253664 0.240654 0.237104
chargesum: 0.00000
title: Mulliken charges with hydrogens summed into heavy atoms:
elementType: O O O O O O C C C C C C C C C C C C C C C C C C C C
charge: -0.216565 -0.259346 -0.262510 -0.210710 -0.261573 -0.259924 0.042154 -0.190086 -0.027601 0.421265 0.199126 0.103301 0.171956 0.117091 0.334669 -0.325019 -0.198381 0.179477 0.164423 -0.205171 -0.129662 0.191700 0.279841 0.162736 -0.092691 0.271499
polarizability: 3.42609562e+02 -2.33322851e+00 2.92056603e+02 9.63693971e+00 -6.51248207e+00 1.37377410e+02
1716.lowfreq: -39.8168 -5.6614 0.0002 0.0006 0.0009 4.4508 6.6080 36.0521 39.3143
frequency: -39.8050 36.0318 39.3105 45.9276 63.6304 75.1568 102.4746 133.6290 152.2251 163.1469 173.8567 190.1217 221.3805 239.1074 259.9197 269.4403 282.4552 314.0284 337.1161 362.7145 405.6292 417.6299 429.8897 443.6634 473.9269 521.5665 534.7171 553.4084 572.0318 606.9206 635.4850 637.2792 660.0089 673.9924 677.9702 679.9208 687.8928 716.3378 727.2387 743.3014 750.9187 771.9035 782.2963 804.9534 816.0160 836.1773 839.3402 844.1161 870.3734 879.4400 895.6138 915.9456 918.9022 939.5550 952.2332 958.2942 973.8120 976.7205 1008.7881 1034.3537 1059.6443 1063.4835 1070.0536 1072.9839 1086.5544 1119.4894 1128.8485 1134.7157 1157.9197 1164.1283 1171.1575 1185.1971 1189.3203 1226.7015 1237.5472 1263.3588 1269.3053 1273.7789 1297.3134 1309.5545 1336.2413 1346.8014 1360.4747 1361.2016 1374.3525 1391.6615 1423.6266 1445.4878 1452.5414 1474.7273 1477.3107 1478.8014 1485.6383 1490.0997 1585.7286 1604.5251 1611.0696 1621.1410 1625.9217 1661.8228 2944.4685 2959.6657 2998.5298 3002.0778 3017.0713 3040.9390 3096.4298 3096.6773 3113.0465 3149.2227 3165.4598 3182.7563 3185.5355 3197.5066
redmass: 2.2604 5.6658 7.0063 6.3344 6.6365 5.8153 2.5456 6.7243 6.4169 5.4584 6.8884 4.0962 6.3255 7.0898 6.0589 5.7495 5.2174 6.2745 6.8297 6.3870 4.1152 3.8738 3.3915 4.7067 3.2234 6.2186 6.7399 6.5760 6.7022 6.3421 4.9886 7.2149 7.0082 7.5223 6.4396 9.4606 8.2233 4.8768 5.3289 6.2210 4.5123 6.2496 6.9105 5.6958 1.5687 8.6141 8.5752 3.4452 1.4124 1.5790 1.4103 2.3791 2.1026 1.3635 9.2560 4.4168 5.8703 5.4963 2.3740 5.2364 3.4313 1.4577 3.1783 1.4994 2.2639 1.0368 1.1081 1.6117 1.9427 1.5999 1.4468 1.3092 2.6212 3.0584 1.3307 1.4835 1.9916 2.1166 1.6313 2.8074 1.8210 1.5983 1.4090 1.3797 3.5799 5.0806 5.1704 4.3390 1.1084 2.0089 1.6209 1.1123 1.4274 1.7851 10.4397 8.1499 8.2272 8.0868 9.6940 12.7418 1.0711 1.0776 1.0644 1.0608 1.0535 1.0947 1.1024 1.1189 1.1105 1.0894 1.0929 1.0958 1.0925 1.0938
irintensity: 14.0910 0.4586 3.3354 2.6398 0.7038 1.2870 13.9486 0.2273 1.9044 2.9603 3.4906 0.1965 2.1565 3.4127 0.2131 0.1169 4.2971 4.2072 1.3020 0.4836 1.9424 0.3275 11.9815 13.8028 0.9407 4.2061 4.8534 4.8070 0.7373 1.8132 12.1047 2.5917 1.0445 1.0219 7.2443 0.0933 0.8362 0.3769 5.5174 9.3931 20.8386 25.5847 22.3101 11.2771 29.0141 19.3074 28.2010 34.9280 14.3261 11.1494 19.5477 13.2179 21.0897 15.3211 108.8433 63.1583 212.3206 186.8910 17.0584 106.9604 22.4406 4.3721 1.5477 8.6193 33.5530 0.0217 1.6933 35.3336 18.5441 24.1756 10.7337 12.1629 189.9052 190.2037 6.8310 68.9496 27.9953 79.8355 46.3565 247.7200 24.0514 0.9615 15.6506 1.6671 30.4594 17.8125 3.5914 120.7085 17.4056 98.0848 79.0476 15.3571 45.6552 86.2442 191.6515 5.3266 35.8160 17.5428 36.5628 323.6503 14.5800 22.2215 73.0489 135.8186 139.4467 30.0920 28.7732 32.0050 29.6642 6.0012 4.5260 4.2750 2.2357 0.2313
temp: 298.150 k
press: 1.00000 atm
elementType: 8 8 8 8 8 8 6 6 6 6 6 6 6 6 6 6 6 6 6 6 6 6 6 6 6 6 1 1 1 1 1 1 1 1 1 1 1 1 1 1
symmnumber: 1
zpe: 773205.4 jmol-1
zpe.correction: 0.294498 hartree
zpe.thermalcorrener: 0.314061 hartree
zpe.thermalcorrenthalpy: 0.315005 hartree
zpe.thermalcorrgfe: 0.245622 hartree
zpe.sumelectzpe: -1220.006601 hartree
zpe.sumelectthermal: -1219.987039 hartree
zpe.sumelectthermalent: -1219.986095 hartree
zpe.sumelectthermalfe: -1220.055477 hartree
dipole: 5.2515 -2.4505 0.3373
dipole: 5.8049
quadrupole: -134.0783 -147.0046 -146.4843
quadrupole: 15.2438 0.9894 0.6346
quadrupole: 8.4441 -4.4822 -3.9619 15.2438 0.9894 0.6346
hfenergy: -1220.3010997 hartree
pointgroup: C01 [X(C20H14O6)]
dipole: 2.0584699 -0.9300043 0.3370839 debye
polarizability: 341.006181|0.1947247|289.2276693|20.6254991|-21.6058066|141.8097244 unknown
InChI: InChI=1S/C20H14O6/c21-20-19-12(7-22-20)3-11-5-16-17(26-9-25-16)6-13(11)18(19)10-1-2-14-15(4-10)24-8-23-14/h1-2,4-6,12H,3,7-9H2
charge 0 multiplicity 1
40 atoms
O  -0.816306 4.302129 -0.556313
O  5.112401 -1.739958 0.361921
O  3.21856 -3.16929 -0.031174
O  -2.49944 2.703755 -0.449794
O  -4.468421 -1.257201 -1.395853
O  -4.605879 -2.578144 0.600329
C  1.169834 2.909173 -0.573926
C  2.282181 2.461895 0.386575
C  -0.082895 2.067712 -0.368118
C  2.493155 0.958879 0.258953
C  -0.007261 0.718143 -0.076891
C  0.656364 4.35242 -0.350624
C  1.351419 0.115404 0.043456
C  -1.276694 2.946316 -0.448667
C  -1.202592 -0.155088 0.128432
C  3.793335 0.407399 0.386129
C  1.523685 -1.302503 -0.067483
C  3.92597 -0.979902 0.283656
C  2.811641 -1.812987 0.055306
C  -2.256475 -0.187061 -0.83484
C  -1.285816 -0.963558 1.297081
C  -3.337054 -1.023182 -0.570562
C  4.689351 -3.160093 0.178498
C  -3.418684 -1.807885 0.600668
C  -2.402332 -1.799059 1.559162
C  -5.389163 -2.068895 -0.562642
H  1.521611 2.792143 -1.620833
H  1.978642 2.709012 1.427115
H  3.224197 3.003848 0.185719
H  0.843717 4.695219 0.684957
H  1.055318 5.088855 -1.06498
H  4.66364 1.047362 0.555054
H  0.671128 -1.957826 -0.256004
H  -2.222344 0.426439 -1.736189
H  -0.474268 -0.923988 2.030738
H  4.928997 -3.723141 1.096841
H  5.186597 -3.56577 -0.718748
H  -2.464484 -2.406258 2.465269
H  -5.749866 -2.925392 -1.151848
H  -6.204866 -1.42312 -0.186268
