program: Gaussian 09
title: 000277354
version: EM64L-G09RevD.01
frameworkgroup: C1[X(C20H29Cl6NO)]
method: RPBEPBE
basis: SDD
operation: Freq
keyword: #p
keyword: freq=noraman
keyword: PBEPBE/SDD
title: #p freq=noraman PBEPBE/SDD
converged: YES YES NO NO
title: Mulliken charges:
elementType: Cl Cl Cl Cl Cl Cl O N C C C C C C C C C C C C C C C C C C C C H H H H H H H H H H H H H H H H H H H H H H H H H H H H H
charge: 0.055711 0.055439 0.119349 0.093110 0.063242 0.061898 -0.292018 -0.141515 0.024655 -0.214736 -0.137118 -0.486777 -0.492459 -0.470449 0.005162 -0.019964 -0.381194 -0.388904 -0.389608 -0.385881 -0.374167 -0.386123 -0.521527 0.230815 -0.340188 -0.353526 -0.634536 -0.673629 0.299303 0.294762 0.255391 0.228541 0.222899 0.202131 0.201298 0.200443 0.199210 0.192917 0.195429 0.199618 0.197066 0.187198 0.185163 0.228157 0.212147 0.224295 0.228301 0.227987 0.205943 0.209208 0.207561 0.221157 0.283259 0.218725 0.210747 0.210702 0.225383
chargesum: 0.00000
title: Mulliken charges with hydrogens summed into heavy atoms:
elementType: Cl Cl Cl Cl Cl Cl O N C C C C C C C C C C C C C C C C C C C C
charge: 0.055711 0.055439 0.119349 0.093110 0.063242 0.061898 -0.292018 -0.141515 0.323958 -0.214736 -0.137118 0.063376 -0.492459 -0.019009 0.005162 -0.019964 0.022234 0.010749 -0.001262 0.010802 -0.001806 0.054181 -0.068931 0.230815 0.093743 0.063244 0.088604 -0.026798
polarizability: 3.19616964e+02 -1.23835378e+00 2.77642047e+02 -3.29137989e+00 -2.54055078e+00 2.43919780e+02
1716.lowfreq: -16.0065 -6.0796 -4.3100 -1.6590 -0.0011 0.0011 0.0018 3.8851 14.0985
frequency: -13.6904 -4.5790 14.0945 18.6422 33.3619 36.7995 48.0089 60.2078 74.3121 76.9616 79.4306 86.1668 96.0528 101.5509 103.0421 111.1005 122.0723 129.8525 137.0238 143.0279 146.3896 148.5563 151.9354 157.4185 161.4163 179.0862 183.6275 204.0440 222.3652 236.4853 249.9960 262.8005 282.4544 293.4321 319.6750 325.5665 343.2576 346.0033 375.2019 386.9678 392.9070 401.7454 436.3104 449.9797 485.7490 497.0930 508.1241 543.2132 555.1972 584.7451 612.6948 637.9390 655.8526 718.3177 724.0972 736.0499 738.7629 747.0001 785.0866 786.5106 796.2484 824.5142 838.0701 854.7345 867.4000 873.8789 884.1602 915.2973 954.0983 962.3883 971.7996 996.0327 1000.0308 1004.7441 1012.1139 1028.1306 1039.3928 1044.8694 1051.0233 1065.1133 1075.0342 1079.8638 1080.2290 1089.5885 1094.3120 1097.5062 1102.7010 1113.6811 1122.9078 1125.4542 1138.6701 1158.3506 1198.4088 1203.8122 1214.4047 1218.4267 1238.8028 1241.1856 1248.3922 1260.2001 1265.1730 1272.3192 1277.2195 1278.7418 1284.6959 1288.5727 1294.3086 1295.1435 1296.8317 1306.6694 1327.2666 1344.1201 1351.9649 1354.8367 1355.4969 1357.9004 1391.1124 1393.4967 1414.0222 1441.5713 1455.8724 1458.5208 1460.1649 1462.9765 1464.9433 1470.6795 1472.4163 1478.2229 1479.1577 1480.9693 1485.0419 1486.5597 1487.8597 1492.4615 1586.9330 1605.5565 2944.5858 2949.7327 2953.3524 2957.6432 2958.3787 2964.6120 2967.4898 2975.0345 2977.4993 2981.2605 2983.5230 2988.9518 2990.3430 2997.7910 2999.7293 3011.3444 3017.3448 3027.7873 3029.5386 3036.7596 3039.6439 3042.8510 3049.3866 3056.8386 3065.0637 3074.1049 3080.3303 3111.9247 3113.5194
redmass: 3.9705 5.0032 6.6637 5.8540 2.5511 2.5511 3.8984 3.8206 8.4240 2.5604 4.5814 5.6756 1.8552 6.7256 4.3198 2.3761 8.1678 1.4019 1.8082 4.1288 4.0576 10.9784 29.6623 7.7415 10.4211 4.1264 2.5656 3.2818 1.3827 3.2631 5.1293 5.9665 3.6733 4.0934 9.6788 9.3241 4.9688 21.8915 3.8371 4.4468 4.0642 5.0568 2.9995 3.3975 2.7921 8.0704 3.3612 6.5513 2.8265 7.0524 7.6109 4.0073 9.5415 1.0629 1.1043 2.3159 1.1531 1.4937 1.4092 3.6884 6.0707 6.1672 1.6114 8.3666 1.2310 2.2743 1.9152 1.4436 3.2332 2.0437 3.1989 4.3551 4.2471 2.6732 2.4530 2.8989 4.1279 3.3647 4.1460 3.1757 1.8050 2.1740 2.1993 2.4835 3.2997 1.5591 1.8108 2.0633 1.4048 3.2614 2.0048 3.0423 1.6929 1.3153 1.6687 1.8364 1.3919 1.5006 2.0232 1.4230 1.3808 1.2682 1.1505 1.1747 1.1452 1.0826 1.2307 1.2503 1.1377 1.2997 1.3598 1.4482 1.4294 1.5965 1.5686 1.6215 1.2957 1.7299 1.3795 1.0881 1.0772 1.0738 1.0717 1.0695 1.0878 1.0712 1.0951 1.0644 1.0441 1.0965 1.1522 1.0984 1.0646 1.0840 7.0051 11.9769 1.0589 1.0588 1.0588 1.0598 1.0603 1.0588 1.0363 1.0365 1.0591 1.0616 1.0966 1.0981 1.0618 1.0867 1.0759 1.0969 1.1026 1.0915 1.0982 1.0973 1.0646 1.1015 1.1011 1.1001 1.1030 1.1021 1.0990 1.1057 1.0970
irintensity: 0.6715 0.2225 0.3305 0.6735 0.0487 0.3678 0.6025 0.5908 0.4967 0.0557 1.7235 0.4886 0.1381 0.2924 1.2845 0.5092 0.0199 0.1479 0.0885 0.1787 0.0134 0.0599 0.0349 0.4903 0.0442 0.8012 3.2821 0.3216 1.5152 3.6150 1.1684 0.9005 1.0516 0.5142 1.2722 1.5557 6.1083 1.4142 3.4495 0.2471 0.9900 12.6041 0.2693 7.8680 1.8501 12.3166 6.3954 23.1352 4.2983 10.9649 29.4495 2.3767 29.1297 15.5977 1.1003 45.0917 12.0206 6.2036 6.0860 2.0126 84.2283 4.7910 0.3567 5.9330 0.3700 7.7819 10.8719 4.8510 0.7334 13.2770 21.7174 11.9881 20.6917 6.3623 11.2754 22.8694 7.7497 3.8934 31.8531 0.3728 26.3126 0.2499 2.6258 8.0149 0.5677 1.6322 3.5485 3.7523 5.4798 28.2911 72.4788 14.9503 2.9228 25.9562 8.4464 49.5767 6.6648 2.4581 3.9706 10.5655 23.6962 1.3598 6.4770 1.8231 13.0862 1.2047 0.8052 1.4940 1.1763 0.4194 1.1641 1.4926 6.3125 0.3719 0.1244 0.0689 11.0200 86.6180 91.0347 10.2675 5.3623 0.3145 1.5000 0.7684 2.6367 2.1707 3.5147 1.6386 13.1276 0.4776 16.9167 22.8261 4.7541 33.8644 272.6461 49.2457 7.4773 2.5036 3.7337 1.1646 19.4480 110.4350 62.4427 28.4556 35.3264 19.8229 4.0142 1.6221 63.8134 12.0941 21.8766 11.5325 0.1140 5.9283 4.9283 46.7673 16.8278 37.4685 87.9622 5.2743 76.8505 98.8459 40.6904 4.8880 1.5958
temp: 298.150 k
press: 1.00000 atm
elementType: 17 17 17 17 17 17 8 7 6 6 6 6 6 6 6 6 6 6 6 6 6 6 6 6 6 6 6 6 1 1 1 1 1 1 1 1 1 1 1 1 1 1 1 1 1 1 1 1 1 1 1 1 1 1 1 1 1
symmnumber: 1
zpe: 1186084.8 jmol-1
zpe.correction: 0.451756 hartree
zpe.thermalcorrener: 0.483582 hartree
zpe.thermalcorrenthalpy: 0.484526 hartree
zpe.thermalcorrgfe: 0.384663 hartree
zpe.sumelectzpe: -3667.641438 hartree
zpe.sumelectthermal: -3667.609611 hartree
zpe.sumelectthermalent: -3667.608667 hartree
zpe.sumelectthermalfe: -3667.708531 hartree
dipole: 5.6142 4.0385 -1.1539
dipole: 7.0114
quadrupole: -208.2217 -221.4860 -212.3553
quadrupole: 32.5077 -12.1470 1.9099
quadrupole: 5.7993 -7.4650 1.6657 32.5077 -12.1470 1.9099
hfenergy: -3668.0931934 hartree
pointgroup: C01 [X(C20H29Cl6N1O1)]
dipole: 2.2042252 -1.648517 0.1821044 debye
polarizability: 319.5465864|0.5179592|277.4497739|4.1815373|3.5809722|244.1824306 unknown
InChI: InChI=1S/C20H29Cl6NO/c1-3-12-27(2)15(28)11-9-7-5-4-6-8-10-14-13-18(23)16(21)17(22)19(14,24)20(18,25)26/h14H,3-13H2,1-2H3
charge 0 multiplicity 1
57 atoms
Cl -5.628459 1.90728 1.923596
Cl -6.555648 -2.755137 -1.259728
Cl -8.177087 -0.054712 0.408822
Cl -6.339666 -1.63211 2.162585
Cl -5.310323 2.754106 -1.36255
Cl -5.849938 -0.15266 -3.33596
O  7.396611 2.256532 -0.161797
N  8.74855 0.385537 0.13832
C  -4.009214 -0.158505 0.764734
C  -5.379582 0.617784 0.639132
C  -5.751498 -1.232477 -0.619259
C  -4.277664 -1.435637 -0.128424
C  -6.415164 -0.566348 0.638388
C  -2.767866 0.663281 0.371335
C  -5.532814 1.082458 -0.815281
C  -5.749069 -0.027334 -1.570702
C  -1.451274 -0.082138 0.691997
C  -0.195299 0.735033 0.315823
C  1.126248 -0.00561 0.62001
C  2.381722 0.819363 0.25909
C  3.706996 0.075267 0.538821
C  4.951291 0.915936 0.178683
C  6.269002 0.157701 0.433746
C  7.504038 1.017462 0.108943
C  8.943045 -1.055646 0.399426
C  8.992783 -1.923445 -0.884223
C  9.956095 1.171279 -0.175091
C  9.263734 -3.408632 -0.562813
H  -3.914393 -0.469798 1.82083
H  -4.199789 -2.365262 0.456407
H  -3.599283 -1.496623 -0.995103
H  -2.783657 1.626208 0.91946
H  -2.799056 0.907991 -0.708714
H  -1.420534 -0.323744 1.774869
H  -1.427738 -1.053129 0.154634
H  -0.209346 1.700203 0.86324
H  -0.231504 0.98993 -0.763846
H  1.145126 -0.965523 0.062215
H  1.158731 -0.271124 1.697563
H  2.371327 1.772177 0.827871
H  2.341113 1.099344 -0.814229
H  3.746926 -0.208573 1.61207
H  3.717898 -0.875701 -0.035372
H  4.958123 1.85771 0.757524
H  4.907669 1.218846 -0.885055
H  6.285165 -0.7764 -0.162523
H  6.316181 -0.154305 1.498635
H  8.144978 -1.426514 1.066155
H  9.89625 -1.175737 0.952332
H  8.03432 -1.820883 -1.429037
H  9.780588 -1.534703 -1.557997
H  10.656506 1.167323 0.682088
H  9.643199 2.205545 -0.384957
H  10.478311 0.762911 -1.061249
H  10.229595 -3.533998 -0.037737
H  8.47207 -3.829664 0.085473
H  9.301271 -4.015836 -1.484675
