program: Gaussian 09
title: 000270040
version: EM64L-G09RevD.01
frameworkgroup: C1[X(C15H15N3O3)]
method: RPBEPBE
basis: SDD
operation: Freq
keyword: #p
keyword: freq=noraman
keyword: PBEPBE/SDD
title: #p freq=noraman PBEPBE/SDD
converged: YES YES NO NO
title: Mulliken charges:
elementType: O O O N N N C C C C C C C C C C C C C C C H H H H H H H H H H H H H H H
charge: -0.442902 -0.221929 -0.211786 -0.148630 -0.078361 0.016269 0.411046 0.457451 -0.360798 -0.335802 -0.392370 -0.401639 -0.645512 -0.646257 0.129412 -0.390096 -0.501016 0.226926 0.416990 -0.328673 -0.376167 0.237688 0.239363 0.223189 0.273740 0.238209 0.219750 0.238132 0.218802 0.240149 0.240245 0.271394 0.308365 0.219985 0.286518 0.368317
chargesum: 0.00000
title: Mulliken charges with hydrogens summed into heavy atoms:
elementType: O O O N N N C C C C C C C C C C C C C C C
charge: -0.074585 -0.221929 -0.211786 -0.148630 -0.078361 0.016269 0.411046 0.457451 -0.123110 -0.096440 -0.169181 -0.127899 0.050579 0.052939 0.129412 -0.118702 -0.192652 0.226926 0.416990 -0.108688 -0.089649
polarizability: 5.19760804e+02 9.84194592e+00 2.23050430e+02 6.77300703e-01 -6.63083953e-01 8.45058427e+01
1716.lowfreq: 0.0006 0.0009 0.0010 2.0240 3.5268 5.9708 16.8759 32.0163 44.4774
frequency: 15.3994 31.9885 44.4564 57.0449 75.8981 92.5579 106.7848 123.8340 145.2272 153.9353 173.6058 200.5888 227.3704 236.6885 254.0028 285.9257 326.8993 344.2324 363.2179 374.0860 388.5660 413.6252 429.1469 452.3265 469.4300 485.8435 520.8495 523.8292 554.6000 560.5080 622.5559 632.7430 634.6951 700.0999 720.9620 731.2019 748.6365 752.8862 761.8963 805.9009 807.6471 832.6254 854.5043 919.9471 940.7821 941.2641 946.9116 948.1492 987.3600 994.4888 998.3624 1056.5331 1064.4295 1097.0291 1105.9614 1111.6912 1126.9903 1154.0590 1164.7518 1170.5289 1192.4374 1217.1879 1240.8270 1256.8580 1264.7176 1272.6028 1315.6631 1347.0519 1363.8889 1369.3063 1385.0371 1400.7216 1430.4716 1436.5031 1451.3430 1460.2704 1465.5102 1477.1029 1477.7764 1492.8594 1506.6551 1533.4564 1541.7353 1562.6313 1576.1791 1610.1674 1633.9946 2947.4135 2954.8643 3015.2273 3019.7648 3043.1538 3100.5842 3110.2770 3113.2190 3116.0221 3148.0853 3166.1668 3170.8594 3192.5325 3194.6290 3559.7947
redmass: 3.7440 5.1898 6.3462 8.9275 2.3655 4.9911 6.8724 1.7321 6.1458 2.1102 6.4509 1.1683 4.6261 2.7369 3.5797 5.0419 3.8399 9.3048 6.0200 3.8876 3.9559 1.2758 2.7843 4.9819 3.4023 4.2234 4.4487 2.4354 4.4129 4.6574 7.6989 6.8239 7.0523 5.2672 5.3651 3.5276 3.7305 5.6393 9.9267 1.5797 1.3434 1.6348 4.9414 5.9628 3.0745 1.3995 1.3989 1.3401 1.3944 2.8863 1.5387 1.5046 2.0077 1.8889 1.2370 1.3265 1.4788 1.2087 1.9531 2.3056 1.2676 6.7823 2.5804 2.9169 1.4946 1.8774 1.6028 2.5280 3.4248 4.9207 4.8030 3.5256 1.2730 3.4303 2.7241 1.2937 1.0400 2.8193 1.0557 1.1113 1.1379 2.9541 6.5021 6.0701 7.1429 6.8388 6.3896 1.0368 1.0390 1.1001 1.1023 1.0878 1.0965 1.0946 1.0906 1.0893 1.0874 1.0931 1.0955 1.0937 1.0926 1.0658
irintensity: 0.9215 2.3177 2.0017 0.5461 0.5600 0.1321 1.0464 5.8593 0.8174 1.9972 0.5960 0.0079 0.6924 1.1086 7.4050 2.4640 1.4948 0.2319 4.3558 0.4509 3.0029 130.9464 12.3239 0.2830 0.3804 4.7835 27.8086 36.7093 4.2652 0.4687 3.3946 3.7663 27.8095 27.9230 5.1863 0.2603 0.6693 5.1172 18.8258 51.5559 5.5203 54.6807 2.6418 35.8990 36.4275 28.6448 7.5835 0.5204 3.4370 0.0733 17.4334 30.2756 73.8223 90.6901 0.0126 1.0282 14.6943 1.9723 49.8664 118.2978 195.7259 605.4302 17.6904 27.8647 3.2624 30.6580 19.2246 43.7439 56.0537 420.8397 4.9033 17.7776 17.1656 53.1739 67.4548 19.4410 0.0422 33.4503 22.9815 9.0414 89.8111 588.7555 323.0824 259.5763 72.1168 130.8078 366.4672 99.4019 171.8788 17.9778 61.6086 11.8004 4.0258 49.5099 22.3665 10.5087 2.2357 23.8876 20.1975 4.0530 8.7226 49.0937
temp: 298.150 k
press: 1.00000 atm
elementType: 8 8 8 7 7 7 6 6 6 6 6 6 6 6 6 6 6 6 6 6 6 1 1 1 1 1 1 1 1 1 1 1 1 1 1 1
symmnumber: 1
zpe: 723164.2 jmol-1
zpe.correction: 0.275439 hartree
zpe.thermalcorrener: 0.295009 hartree
zpe.thermalcorrenthalpy: 0.295953 hartree
zpe.thermalcorrgfe: 0.225358 hartree
zpe.sumelectzpe: -968.912788 hartree
zpe.sumelectthermal: -968.893218 hartree
zpe.sumelectthermalent: -968.892273 hartree
zpe.sumelectthermalfe: -968.962869 hartree
dipole: -8.4883 5.7509 0.1300
dipole: 10.2539
quadrupole: -103.6988 -109.3003 -127.3092
quadrupole: 35.9461 0.8183 -0.4157
quadrupole: 9.7373 4.1358 -13.8731 35.9461 0.8183 -0.4157
hfenergy: -969.1882265 hartree
pointgroup: C01 [X(C15H15N3O3)]
dipole: 3.2553553 1.6526153 -1.7164297 debye
polarizability: 519.1153803|-13.3666768|164.2599253|-15.6203666|-67.8707857|143.941771 unknown
InChI: InChI=1S/C15H15N3O3/c1-17(2)12-5-3-11(4-6-12)10-16-14-9-13(18(20)21)7-8-15(14)19/h3-10,19H,1-2H3
charge 0 multiplicity 1
36 atoms
O  -1.858694 2.176668 -1.755283
O  -6.313941 -1.059165 1.482764
O  -4.423456 -2.062993 2.272392
N  5.89484 -0.523861 0.172617
N  -0.594052 0.130199 0.018254
N  -5.02694 -1.198569 1.524844
C  4.550999 -0.199649 -0.006168
C  1.771351 0.461164 -0.369853
C  4.155054 0.90234 -0.835261
C  3.513119 -0.960356 0.636328
C  2.798903 1.2151 -1.00603
C  2.165973 -0.633811 0.455461
C  6.940078 0.266132 -0.493382
C  6.275381 -1.657981 1.027891
C  -1.97292 0.381344 -0.109807
C  0.370641 0.817451 -0.571275
C  -2.806233 -0.444485 0.692335
C  -2.645833 1.345105 -0.94727
C  -4.207422 -0.317855 0.668506
C  -4.058019 1.454358 -0.962275
C  -4.857148 0.628499 -0.155953
H  4.908643 1.510594 -1.342515
H  3.770872 -1.807851 1.277444
H  2.521732 2.063086 -1.645896
H  1.376994 -1.213498 0.945622
H  6.840782 0.230183 -1.596918
H  7.9294 -0.138258 -0.228994
H  6.911911 1.329503 -0.180985
H  7.372078 -1.754706 1.040192
H  5.852799 -2.612412 0.655339
H  5.934102 -1.516878 2.072939
H  0.176198 1.679462 -1.231304
H  -2.326091 -1.186792 1.333517
H  -4.533199 2.199756 -1.61407
H  -5.946907 0.698801 -0.151612
H  -2.424792 2.777177 -2.302993
