program: Gaussian 09
title: 000277259
version: EM64L-G09RevD.01
frameworkgroup: C1[X(C15H11N3)]
method: RPBEPBE
basis: SDD
operation: Freq
keyword: #pfreq=noraman
keyword: PBEPBE/SDD
title: #p freq=noraman PBEPBE/SDD
converged: YES YES NO NO
title: Mulliken charges:
elementType: N N N C C C C C C C C C C C C C C C H H H H H H H H H H H
charge: -0.503517 -0.080260 -0.028244 0.220525 0.157175 0.193924 0.214422 -0.596654 0.056111 -0.389627 -0.365231 -0.254785 -0.213208 -0.272406 -0.207818 -0.143405 -0.365643 -0.177587 0.309680 0.256548 0.322626 0.246633 0.232879 0.225977 0.224470 0.212995 0.241061 0.246568 0.236791
chargesum: 0.00000
title: Mulliken charges with hydrogens summed into heavy atoms:
elementType: N N N C C C C C C C C C C C C C C C
charge: -0.193837 -0.080260 -0.028244 0.220525 0.157175 0.193924 0.214422 -0.017480 0.056111 -0.142994 -0.132352 -0.028808 0.011261 -0.059411 0.033243 -0.143405 -0.119075 0.059204
polarizability: 3.22685097e+02 -1.14675019e+00 1.81445148e+02 -8.76946584e-02 -1.33598364e+01 8.84042795e+01
1716.lowfreq: -10.1919 -2.7557 -0.0009 -0.0007 -0.0006 4.4390 22.8491 42.1249 60.5049
frequency: 22.6197 42.1166 60.4965 80.1185 112.5654 163.7339 177.6745 227.9509 277.3118 291.1974 317.7352 345.4774 358.6313 401.0909 430.0436 441.4375 494.7223 505.9546 559.2618 564.2335 572.9840 605.2912 621.4677 679.1455 688.5672 734.4924 738.1381 751.6434 766.6277 791.4975 819.4831 852.2764 879.7795 885.4361 924.7475 937.1141 950.9308 957.3847 961.2059 976.4921 993.7124 1012.1058 1037.9671 1065.4343 1090.2436 1120.1207 1160.6457 1171.0363 1175.0838 1207.5460 1249.4659 1261.2911 1271.4469 1303.7898 1315.2419 1328.3339 1351.1678 1404.8657 1412.5717 1424.5116 1454.0173 1457.7917 1469.3019 1488.4865 1541.6816 1575.4588 1584.5886 1590.1882 1631.1130 2191.8991 2966.1488 3022.0199 3128.1892 3129.0726 3133.2148 3138.1154 3150.7675 3152.7595 3166.9399 3175.6959 3614.6692
redmass: 6.5615 4.7183 5.1085 6.8590 4.7969 4.6646 4.6966 3.3555 4.3880 7.1352 5.8090 5.1980 3.6213 3.3621 3.0614 7.3296 1.2970 2.5760 6.0007 4.4815 4.1899 5.6059 6.1512 5.4622 6.2044 4.1309 1.7160 1.5054 3.1825 2.6579 4.5019 1.5108 1.6556 2.7525 4.4862 1.4102 2.6783 1.4474 5.2933 1.3118 1.3461 2.1713 2.8225 3.0106 1.8175 1.6389 1.5602 1.1299 1.2815 1.3749 1.6471 1.9369 1.6210 1.5568 5.1417 3.6143 1.8314 1.9129 4.4814 2.2823 3.4910 1.1328 3.2207 3.1946 5.7550 6.5171 6.3040 6.1307 7.1155 12.4000 1.0596 1.0990 1.0856 1.0877 1.0901 1.0890 1.0954 1.0942 1.1002 1.1008 1.0800
irintensity: 2.2679 1.8984 1.1648 2.7005 0.8342 1.7290 2.4162 4.9333 2.9707 0.2394 2.2979 1.3053 0.1514 1.0966 7.8652 2.0878 58.6507 38.6699 8.2433 4.7144 2.1362 8.7304 1.3275 2.7916 3.2003 14.2477 27.5722 100.8299 21.8704 38.6924 2.4121 0.1878 0.7040 0.4326 10.5527 3.1522 2.3137 0.8779 4.7734 0.0360 0.0576 6.6781 2.5927 0.5178 14.3206 2.1077 4.8171 7.4942 1.6878 23.5626 22.1586 14.8594 32.4045 13.8818 3.1479 19.6266 38.5307 34.9039 36.7482 8.2025 4.2728 33.8689 52.4160 0.4648 42.7830 4.1270 190.1716 79.2157 1.9933 17.4734 39.8726 34.7748 0.3610 30.3992 1.4496 4.4593 25.5020 22.0189 34.3300 22.0729 42.0987
temp: 298.150 k
press: 1.00000 atm
elementType: 7 7 7 6 6 6 6 6 6 6 6 6 6 6 6 6 6 6 1 1 1 1 1 1 1 1 1 1 1
symmnumber: 1
zpe: 580713.9 jmol-1
zpe.correction: 0.221182 hartree
zpe.thermalcorrener: 0.235559 hartree
zpe.thermalcorrenthalpy: 0.236503 hartree
zpe.thermalcorrgfe: 0.178266 hartree
zpe.sumelectzpe: -741.229856 hartree
zpe.sumelectthermal: -741.215479 hartree
zpe.sumelectthermalent: -741.214535 hartree
zpe.sumelectthermalfe: -741.272772 hartree
dipole: 3.5891 -5.9816 -1.6140
dipole: 7.1600
quadrupole: -83.5130 -105.7274 -111.3707
quadrupole: 2.9395 4.7081 -13.9902
quadrupole: 16.6907 -5.5237 -11.1670 2.9395 4.7081 -13.9902
hfenergy: -741.4510384 hartree
pointgroup: C01 [X(C15H11N3)]
dipole: -1.1640817 2.4815738 -0.6496265 debye
polarizability: 320.915658|-14.8441015|182.6849861|8.349599|13.6550561|88.9338805 unknown
InChI: InChI=1S/C15H11N3/c16-9-8-12-11-5-1-2-6-13(11)18-15(12)14-7-3-4-10-17-14/h1-7,10,18H,8H2
charge 0 multiplicity 1
29 atoms
N  0.476008 1.590427 0.098069
N  -2.547625 -0.43713 -0.668286
N  0.817844 -3.853965 1.181215
C  0.475537 -0.651705 -0.343002
C  1.845684 -0.207954 -0.211443
C  -0.352393 0.471618 -0.147243
C  1.816845 1.206306 0.054045
C  0.025396 -2.067493 -0.639036
C  -1.814679 0.60512 -0.139737
C  3.100474 -0.871706 -0.293166
C  2.993622 1.969952 0.217107
C  4.275726 -0.117116 -0.127705
C  4.223079 1.288405 0.121773
C  -2.460453 1.762007 0.390147
C  -3.865228 1.856167 0.345622
C  0.468897 -3.050905 0.369831
C  -3.902959 -0.334118 -0.689446
C  -4.611828 0.791775 -0.210268
H  0.148326 2.549255 0.184376
H  0.412923 -2.394975 -1.625222
H  -1.078457 -2.074371 -0.710437
H  3.152049 -1.951317 -0.469721
H  2.960098 3.046745 0.416143
H  5.251402 -0.61145 -0.185432
H  5.158286 1.845386 0.246605
H  -1.881707 2.563632 0.861205
H  -4.370408 2.739891 0.749308
H  -4.437116 -1.193088 -1.11162
H  -5.703845 0.824106 -0.263283
