program: Gaussian 09
title: 000270039
version: EM64L-G09RevD.01
frameworkgroup: C1[X(C15H16N2O)]
method: RPBEPBE
basis: SDD
operation: Freq
keyword: #p
keyword: freq=noraman
keyword: PBEPBE/SDD
title: #p freq=noraman PBEPBE/SDD
converged: YES YES NO NO
title: Mulliken charges:
elementType: O N N C C C C C C C C C C C C C C C H H H H H H H H H H H H H H H H
charge: -0.435372 -0.150253 -0.088462 0.409020 0.464889 -0.362659 -0.338155 -0.399660 -0.408066 -0.646209 -0.646615 -0.396243 0.245066 -0.316860 -0.351170 -0.347068 -0.363182 0.274211 0.236164 0.236305 0.220890 0.269755 0.236501 0.217724 0.236401 0.217105 0.237594 0.237492 0.206179 0.238368 0.250769 0.246826 0.217121 0.351591
chargesum: 0.00000
title: Mulliken charges with hydrogens summed into heavy atoms:
elementType: O N N C C C C C C C C C C C C C C C
charge: -0.083781 -0.150253 -0.088462 0.409020 0.464889 -0.126496 -0.101850 -0.178769 -0.138311 0.044417 0.045576 -0.190064 0.245066 -0.078491 -0.100402 -0.100242 -0.146061 0.274211
polarizability: 4.68544439e+02 -5.61145175e+00 1.65495309e+02 2.01668647e+00 -4.63256262e+00 8.82133833e+01
1716.lowfreq: -5.1026 -2.1186 -0.0005 -0.0003 0.0009 6.7614 30.6390 34.4259 46.5850
frequency: 30.5953 34.3819 46.5840 75.3222 82.5186 111.5654 131.0015 167.3251 190.2755 200.5971 212.8480 251.5077 284.2630 345.2703 351.7619 372.9229 387.0965 404.7111 415.1638 427.5713 458.1340 485.7644 497.4861 518.4910 538.0273 574.3609 630.0574 637.1628 711.8673 717.8350 741.6397 766.0788 801.9015 805.9154 821.7026 828.5861 830.0058 864.2018 931.9386 939.3797 941.2158 946.8173 973.4728 986.9355 994.9175 995.0957 1056.5264 1097.7393 1107.4928 1111.0184 1125.4064 1143.3157 1158.2143 1165.4292 1179.3583 1197.4717 1242.5165 1258.5286 1263.1904 1298.9279 1317.7259 1355.6605 1365.6544 1377.6885 1391.8184 1428.1911 1429.7813 1447.4908 1460.0773 1464.4745 1476.1499 1492.4471 1492.9369 1506.6146 1532.0407 1549.5197 1578.6809 1584.6694 1626.9664 1633.2485 2929.7020 2943.2349 2950.8586 3009.7072 3013.3464 3098.1443 3107.6944 3112.7216 3113.0166 3132.7423 3144.4364 3162.0144 3162.2937 3167.0228 3167.3568 3582.5928
redmass: 5.3038 3.5193 4.9944 2.5330 4.2487 1.8247 3.2001 2.8686 2.6590 1.4524 4.2116 2.3138 4.1215 3.7284 1.1428 4.1242 4.3056 4.7828 3.0745 3.0729 4.0795 4.3825 3.6974 2.6106 2.3186 4.7861 7.1220 6.9739 4.6861 3.7146 3.4487 6.2481 1.2806 1.3282 1.7433 4.4001 1.8736 4.2171 1.3542 1.4787 2.6672 1.3484 1.5138 1.4118 2.8215 2.7148 1.4978 1.3838 1.2412 1.3192 1.4942 1.3837 1.5088 1.6125 1.4912 1.3633 2.4698 2.8404 1.8450 1.4113 1.5434 2.0471 3.7710 4.1789 2.7641 3.6766 1.3007 2.5911 1.2476 1.0439 1.0458 1.7210 1.3791 1.1597 2.7704 7.1203 6.3651 5.8112 6.4464 6.3694 1.0850 1.0368 1.0393 1.0998 1.1025 1.0962 1.0943 1.0892 1.0897 1.0884 1.0873 1.0932 1.0944 1.0959 1.0956 1.0660
irintensity: 1.1258 1.6872 0.5774 0.1559 0.3956 5.0244 0.3721 4.0164 3.4846 1.1650 2.4281 1.6270 4.3174 21.7755 136.7757 14.5023 13.0259 1.1229 2.7542 0.4556 2.0846 15.9106 12.9057 3.0108 48.0399 0.4759 0.1032 1.1572 0.4260 3.0563 2.6276 49.2124 6.1866 13.3294 38.4482 10.3320 89.0046 12.9578 2.6373 9.3813 25.4876 0.9633 11.8309 6.7641 1.7918 1.7114 26.5209 73.0240 0.0629 1.0685 8.5346 323.3614 32.5386 7.3669 173.6268 13.8078 35.3760 26.2031 35.0839 8.7879 9.1702 29.1952 256.5156 38.4054 0.4313 25.5845 13.5476 29.3264 13.4331 0.6202 22.2669 102.2264 88.0399 20.3176 415.1935 77.7681 18.9879 179.6225 205.8728 283.3530 67.3083 105.7505 163.4061 13.1237 72.7328 4.2994 52.8043 10.9819 34.5021 8.8102 3.8843 24.0574 15.1060 14.6830 11.0591 73.0135
temp: 298.150 k
press: 1.00000 atm
elementType: 8 7 7 6 6 6 6 6 6 6 6 6 6 6 6 6 6 6 1 1 1 1 1 1 1 1 1 1 1 1 1 1 1 1
symmnumber: 1
zpe: 718812.9 jmol-1
zpe.correction: 0.273781 hartree
zpe.thermalcorrener: 0.290767 hartree
zpe.thermalcorrenthalpy: 0.291711 hartree
zpe.thermalcorrgfe: 0.227927 hartree
zpe.sumelectzpe: -764.609577 hartree
zpe.sumelectthermal: -764.592591 hartree
zpe.sumelectthermalent: -764.591647 hartree
zpe.sumelectthermalfe: -764.655432 hartree
dipole: 4.7827 0.4852 -0.6008
dipole: 4.8447
quadrupole: -66.9732 -95.4201 -112.1517
quadrupole: -9.2003 5.3844 -1.0522
quadrupole: 24.5418 -3.9051 -20.6367 -9.2003 5.3844 -1.0522
hfenergy: -764.8833582 hartree
pointgroup: C01 [X(C15H16N2O1)]
dipole: 1.8838462 0.0218087 0.2892249 debye
polarizability: 468.4665088|0.8309164|122.7952929|-7.895043|-38.6904061|130.9913295 unknown
InChI: InChI=1S/C15H16N2O/c1-17(2)14-7-3-12(4-8-14)11-16-13-5-9-15(18)10-6-13/h3-11,18H,1-2H3
charge 0 multiplicity 1
34 atoms
O  -6.842889 0.189566 -0.151738
N  5.33319 -0.12702 0.045106
N  -1.213333 -0.271762 0.34452
C  3.947998 0.032987 -0.023808
C  1.088113 0.356449 -0.160973
C  3.36105 1.13689 -0.725065
C  3.059951 -0.904786 0.606824
C  1.966707 1.284961 -0.785827
C  1.671722 -0.741587 0.53593
C  6.220206 0.846465 -0.60508
C  5.910473 -1.264584 0.774349
C  -0.360511 0.540664 -0.243078
C  -2.614713 -0.118521 0.185047
C  -3.243263 0.410821 -0.984064
C  -3.445806 -0.580336 1.242539
C  -4.643939 0.501412 -1.075975
C  -4.848168 -0.477524 1.165634
C  -5.448017 0.068306 0.003834
H  3.994806 1.877361 -1.220732
H  3.464169 -1.762715 1.151694
H  1.544019 2.140764 -1.328685
H  0.998264 -1.458114 1.018012
H  6.042936 0.897226 -1.698487
H  7.268932 0.550823 -0.445763
H  6.086232 1.866115 -0.189873
H  7.009203 -1.216074 0.718035
H  5.589873 -2.234617 0.343738
H  5.623631 -1.255013 1.845368
H  -0.695155 1.432549 -0.817873
H  -2.631965 0.719029 -1.840065
H  -2.962429 -1.010589 2.125091
H  -5.132609 0.890553 -1.974435
H  -5.470503 -0.828056 1.999775
H  -7.313378 -0.151442 0.648824
