program: Gaussian 09
title: 000270014
version: EM64L-G09RevD.01
frameworkgroup: C1[X(C13H9NS2)]
method: RPBEPBE
basis: SDD
operation: Freq
keyword: #p
keyword: freq=noraman
keyword: PBEPBE/SDD
title: #p freq=noraman PBEPBE/SDD
converged: YES YES NO NO
title: Mulliken charges:
elementType: S S N C C C C C C C C C C C C C H H H H H H H H H
charge: 0.398928 0.039093 -0.597532 0.581632 -0.361107 -0.364653 0.509324 -0.347070 -0.257474 -0.330622 -0.387788 -0.227086 -0.220104 -0.209952 -0.209197 -0.239282 0.274438 0.245072 0.281148 0.253884 0.236169 0.235378 0.232617 0.231289 0.232895
chargesum: 0.00000
title: Mulliken charges with hydrogens summed into heavy atoms:
elementType: S S N C C C C C C C C C C C C C
charge: 0.398928 0.039093 -0.597532 0.581632 -0.361107 -0.364653 0.509324 -0.072631 -0.012402 -0.049474 -0.133905 0.009083 0.015274 0.022664 0.022092 -0.006387
polarizability: 2.89720180e+02 1.17992372e+00 1.94791921e+02 8.87720019e-01 4.66459071e+00 8.39085096e+01
1716.lowfreq: -7.9137 -3.3496 -0.0017 -0.0015 -0.0010 7.5238 34.9165 42.3347 85.3386
frequency: 34.7924 42.3108 85.3339 118.0263 166.9857 203.6750 207.8238 253.0726 264.4015 355.3328 392.9027 402.7417 417.0067 426.1298 474.7250 480.8448 508.3833 573.6912 606.0828 611.9000 663.5547 682.6710 691.8824 732.2423 742.5209 772.9253 786.7342 834.9476 841.3007 875.5783 918.5728 962.8875 969.2515 986.9586 992.8053 995.1510 998.8051 1018.0155 1025.8580 1065.9447 1083.2612 1119.6139 1172.1364 1173.4293 1175.2305 1187.0068 1259.0974 1284.4620 1313.6386 1325.9003 1382.2186 1395.1527 1434.5806 1441.4887 1447.3335 1477.0433 1574.8987 1590.0400 1599.3680 1602.9954 3131.8564 3134.9633 3140.5874 3142.1521 3152.5593 3155.6631 3167.4478 3170.9015 3186.5984
redmass: 4.4632 6.4515 5.7619 5.2419 6.3355 9.9559 6.4466 5.2850 7.1220 6.3502 11.2270 2.8396 5.1363 5.4632 4.5204 8.4614 3.7567 7.5045 5.2994 5.9996 6.6143 5.6681 2.1994 2.8915 2.4737 1.4798 3.0721 1.2492 6.7500 1.3740 1.4366 1.3781 1.3855 4.8549 1.6339 4.4943 1.3383 2.4507 2.1244 3.5830 1.5728 1.6403 1.3882 1.0520 1.7125 1.2419 1.8379 2.6797 2.2619 2.1678 9.2555 8.9537 2.3413 2.3326 2.6886 2.3449 6.8865 6.4344 6.5028 6.3550 1.0852 1.0863 1.0891 1.0899 1.0944 1.0949 1.0994 1.1005 1.0968
irintensity: 0.9232 1.0420 1.6487 0.1144 0.2980 2.9758 2.1740 1.4857 0.6448 2.1518 0.6172 0.7835 1.8945 1.6411 7.2305 3.3552 4.4502 5.3413 1.2301 1.8145 1.3683 10.3855 30.2328 16.5885 90.2365 68.2379 17.7158 1.4524 2.7693 1.3509 2.9143 2.3834 0.7593 1.7740 2.0109 11.7484 0.2917 8.7287 11.5206 5.3181 8.5466 8.7539 2.6774 0.0580 16.0484 3.5170 31.1840 54.6021 57.4115 52.1658 2.2274 5.2605 56.5124 7.2896 0.3771 70.9155 5.2784 4.3796 31.6610 2.0333 1.7032 1.4461 8.3182 0.9247 23.4313 9.0906 26.1446 30.7975 2.3254
temp: 298.150 k
press: 1.00000 atm
elementType: 16 16 7 6 6 6 6 6 6 6 6 6 6 6 6 6 1 1 1 1 1 1 1 1 1
symmnumber: 1
zpe: 476152.0 jmol-1
zpe.correction: 0.181357 hartree
zpe.thermalcorrener: 0.194309 hartree
zpe.thermalcorrenthalpy: 0.195253 hartree
zpe.thermalcorrgfe: 0.140542 hartree
zpe.sumelectzpe: -1350.563739 hartree
zpe.sumelectthermal: -1350.550786 hartree
zpe.sumelectthermalent: -1350.549842 hartree
zpe.sumelectthermalfe: -1350.604553 hartree
dipole: -0.9119 -3.5053 0.5780
dipole: 3.6678
quadrupole: -80.6152 -106.6453 -110.3621
quadrupole: 0.9383 0.3504 4.8584
quadrupole: 18.5923 -7.4378 -11.1546 0.9383 0.3504 4.8584
hfenergy: -1350.7450953 hartree
pointgroup: C01 [X(C13H9N1S2)]
dipole: 0.3314334 -1.3607156 -0.3477842 debye
dipolederiv: -0.3212525 -0.0646903 -0.0303878 -0.131563 -0.3870044 -0.1186561 0.0537213 -0.0812877 0.125524 -0.3627684 0.0902303 0.037278 0.0125688 -0.8238739 -0.1602246 -0.0396562 -0.1399344 -0.2276764 -0.6365586 -0.5959 -0.1329198 -0.4781122 -0.0345622 0.0820702 -0.1500062 0.0528016 -0.1554143 -0.4049701 0.260892 0.0574665 0.0256855 -0.2957129 -0.0954606 0.0256296 -0.0788099 0.0651716 0.558308 0.2715631 0.0848175 0.2037165 0.1683542 0.060719 0.0644095 0.0404623 -0.0668566 0.6632355 0.0368665 0.0126647 0.15001 1.102189 0.3097898 0.0060677 0.2606905 -0.0219009 0.8564408 0.1757223 0.0178169 -0.0097373 -0.0338747 -0.0936117 0.0067401 -0.0388551 0.1107159 0.1083882 -0.1731208 -0.0377647 0.0737485 0.0068559 0.0167598 0.0200531 0.024723 -0.0974852 -0.3369444 -0.1469245 -0.0360877 -0.1637601 0.0914533 0.0440571 -0.0662278 0.0434058 -0.1159896 -0.1619245 0.0114283 -0.055678 0.1307902 -0.0175181 -0.0535475 0.0884037 0.0001963 -0.0842301 -0.0926898 -0.0698543 0.0353793 -0.0318291 -0.0675985 -0.0511596 0.010955 -0.0579474 -0.1079335 0.0032236 0.2049522 0.0453937 0.1828906 -0.1226628 0.0048449 0.0274891 0.0076196 -0.1596117 0.060244 0.0095428 0.0065243 0.0363582 0.144545 0.0623668 0.0084886 0.0599329 -0.1272125 -0.002141 -0.095093 0.0646878 -0.0826127 0.0418196 -0.115603 0.0444116 -0.0959233 -0.0757652 -0.0839734 0.0614663 -0.0470211 0.1146704 0.0256618 -0.1072795 -0.1189699 -0.1217369 -0.0762207 0.0519324 -0.0159602 -0.008644 -0.0445192 -0.0887308 -0.0499472 0.0358376 -0.0369769 -0.1261281 0.1456654 0.052833 0.0091756 -0.0286838 0.0244978 -0.0243847 -0.0026563 -0.0253594 0.1455535 0.0917325 -0.027919 -0.0061863 0.042976 -0.0636554 -0.0474988 0.0057163 -0.0464036 0.1562105 0.0997475 -0.0572539 0.0412772 -0.0563915 0.0470969 0.0615443 0.0479193 0.0155554 0.1093021 0.0600481 0.085094 -0.046828 0.0841954 0.0575514 0.0777718 -0.0683216 0.0477635 0.0982066 -0.076255 -0.0756047 -0.0166967 -0.0965632 0.037913 -0.0263272 -0.0218452 -0.0260858 0.1562892 -0.0975997 0.0823237 0.0156001 0.0749599 0.0631706 -0.0193647 0.0234564 -0.0190392 0.1553756 0.0063954 0.0539423 -0.0491871 0.0803722 0.0107074 0.1041405 -0.0666451 0.0894591 0.0876549 0.0125035 -0.0686773 0.0423607 -0.0898373 0.0006931 0.1040911 0.0621452 0.0991147 0.0891484 -0.1407876 -0.0058586 -0.0030412 0.0006671 0.1126848 0.0349099 0.0028842 0.026635 0.1432724 unknown
polarizability: 289.6337176|-3.1408964|194.8413059|0.727136|5.0850986|83.9455881 unknown
InChI: InChI=1S/C13H9NS2/c15-13-11-8-4-5-9-12(11)16-14(13)10-6-2-1-3-7-10/h1-9H
charge 0 multiplicity 1
25 atoms
S  0.388306 -1.744907 -0.424466
S  0.047961 2.551306 0.513708
N  -0.399436 -0.104317 -0.07606
C  1.879031 0.438785 0.037735
C  2.003998 -0.946661 -0.24585
C  0.497541 0.937844 0.140128
C  -1.83672 -0.085223 -0.070276
C  3.047848 1.218875 0.208016
C  3.260065 -1.574842 -0.365306
C  -2.546397 0.921775 -0.771114
C  -2.537848 -1.1062 0.618381
C  4.310424 0.608851 0.091544
C  4.414733 -0.779738 -0.194211
C  -3.956931 0.90417 -0.767271
C  -3.949073 -1.120037 0.604478
C  -4.663771 -0.113456 -0.084505
H  2.926776 2.285293 0.430075
H  3.348054 -2.643746 -0.583955
H  -1.99733 1.707809 -1.293921
H  -1.980923 -1.87088 1.170965
H  5.219547 1.204724 0.221322
H  5.402592 -1.244491 -0.283749
H  -4.503611 1.686309 -1.304852
H  -4.486629 -1.910356 1.139224
H  -5.759002 -0.121482 -0.089641
